{"text_format":"1","workbook":"xlsx","n_sheets":8,"sheets":["Übersicht","Arbeitsplan","Berechnung","Lageplan","Flurkarte","Erläuterung","Auswahl","Organisation"],"not_rendered":{"charts":0,"images":14,"macros":1,"external_links":1,"defined_names":9,"comments":1,"pivot_tables":0},"unopened":[],"bounds":{"document_bytes":16777216,"sheet_cells":100000,"rows_first":2000,"rows_last":500,"rows_between":2000,"halvings":0,"cell_chars":16384,"cell_head_chars":4096},"cells_cut":0,"cells_raw":0,"read":"whole","date_system":"1900"}

{"sheet":"Übersicht","index":0,"n_rows":41,"n_cols":1242,"rows_kept":41,"cut":false,"hidden":false,"merged":[[16,26,16,30],[16,31,16,35],[24,29,32,39],[18,30,18,33],[18,24,18,29],[19,24,19,29],[16,36,16,39],[16,2,16,11],[16,12,16,19],[16,20,16,22],[16,24,16,25],[12,2,12,11],[12,12,12,19],[12,31,12,35],[12,26,12,30],[12,20,12,22],[12,24,12,25],[15,2,15,11],[15,12,15,19],[14,31,14,35],[14,2,14,11],[14,36,14,39],[15,20,15,22],[15,24,15,25],[14,12,14,19],[14,20,14,22],[14,24,14,25],[15,26,15,30],[14,26,14,30],[15,31,15,35],[15,36,15,39],[1,43,1,44],[11,12,11,19],[13,20,13,22],[13,31,13,35],[13,12,13,19],[11,26,11,30],[8,19,8,23],[9,19,9,23],[8,11,9,17],[10,19,10,39],[5,30,6,39],[13,2,13,11],[13,36,13,39],[13,24,13,25],[13,26,13,30],[11,2,11,11],[11,20,11,25],[8,24,9,28],[8,35,9,39],[8,30,8,34],[9,30,9,34],[12,36,12,39],[11,36,11,39],[11,31,11,35],[0,1,0,40],[1,1,3,1],[8,2,8,6],[8,9,8,10],[8,7,8,8],[2,37,2,39],[3,37,3,39],[3,33,3,36],[3,29,3,32],[2,29,2,36],[2,25,2,28],[3,25,3,28],[2,23,2,24],[3,23,3,24],[2,15,2,22],[3,15,3,22],[2,2,2,14],[3,2,3,14],[2,45,3,45],[6,43,7,43],[6,44,7,44],[5,45,7,45],[10,43,11,43],[10,44,11,44],[5,47,12,47],[10,45,12,45],[21,44,22,44],[20,47,20,48],[10,46,12,46],[8,43,9,43],[8,44,9,44],[5,46,9,46],[19,45,20,45],[40,1,41,7],[39,37,41,40],[19,30,19,33],[19,35,19,39],[18,35,18,39],[24,16,30,21],[24,22,30,25],[24,26,30,28],[24,13,30,14],[33,13,39,14],[33,8,39,12],[24,8,30,12],[18,10,18,18],[24,2,30,7],[22,2,23,14],[33,2,39,7],[20,24,20,29],[37,16,41,36],[18,2,18,8],[19,10,19,18],[20,10,20,18],[33,16,36,39],[28,44,30,44],[28,43,30,43],[28,45,30,45],[28,46,30,46],[17,50,17,51],[23,50,25,51],[31,2,32,15],[22,19,23,29],[22,30,23,39],[21,50,22,50],[21,51,22,51],[17,30,17,39],[17,2,17,18],[17,19,17,29]]}
[null,{"$f":"+IF(Organisation!F1<1,\"Bitte einschlägige Gemeinde/n im Reiter Organisation mit x auswählen!\",\"\")","v":"Bitte einschlägige Gemeinde/n im Reiter Organisation mit x auswählen!"}]
[null,null,null,null,null,null,null,null,null,null,null,null,null,null,null,null,null,null,null,null,null,null,null,null,null,null,null,null,null,null,null,null,null,null,null,null,null,null,null,null,null,null,null,"Nettoarbeitstage"]
[null,null,"Antragstellende",null,null,null,null,null,null,null,null,null,null,null,null,"Reviername",null,null,null,null,null,null,null,"Revier-   Nr. ",null,"Behörden-  Kürzel",null,null,null,"Reviervorgangsnummer",null,null,null,null,null,null,null,"lfd. Nr.              im Antrag",null,null,null,null,null,519,1,{"$f":"+AS3+AS4","v":1}]
[null,null,null,null,null,null,null,null,null,null,null,null,null,null,null,null,null,null,null,null,null,null,null,null,null,null,null,null,null,null,null,null,null,null,null,null,null,null,null,null,null,null,null,"xxx",0,null,null,null,null,null,null,null,null,null,null,null,null,null,null,null,null,null,null,null,null,null,null,null,null,null,null,null,null,null,null,null,null,null,null,null,null,null,null,null,null,null,null,null,null,null,null,null,null,null,null,null,null,null,null,null,null,null,null,null,null,null,null,null,null,null,null,null,null,null,null,null,null,null,null,null,null,null,null,null,null,null,null,null,null,null,null,null,null,null,null,null,null,null,null,null,null,null,null,null,null,null,null,null,null,null,null,null,null,null,null,null,null,null,null,null,null,null,null,null,null,null,null,null,null,null,null,null,null,null,null,null,null,null,null,null,null,null,null,null,null,null,null,null,null,null,null,null,null,null,null,null,null,null,null,null,null,null,null,null,null,null,null,null,null,null,null,null,null,null,null,null,null,null,null,null,null,null,null,null,null,null,null,null,null,null,null,null,null,null,null,null,null,null,null,null,null,null,null,null,null,null,null,null,null,null,null,null,null,null,null,null,null,null,null,null,null,null,null,null,null,null,null,null,null,null,null,null,null,null,null,null,null,null,null,null,null,null,null,null,null,null,null,null,null,null,null,null,null,null,null,null,null,null,null,null,null,null,null,null,null,null,null,null,null,null,null,null,null,null,null,null,null,null,null,null,null,null,null,null,null,null,null,null,null,null,null,null,null,null,null,null,null,null,null,null,null,null,null,null,null,null,null,null,null,null,null,null,null,null,null,null,null,null,null,null,null,null,null,null,null,null,null,null,null,null,null,null,null,null,null,null,null,null,null,null,null,null,null,null,null,null,null,null,null,null,null,null,null,null,null,null,null,null,null,null,null,null,null,null,null,null,null,null,null,null,null,null,null,null,null,null,null,null,null,null,null,null,null,null,null,null,null,null,null,null,null,null,null,null,null,null,null,null,null,null,null,null,null,null,null,null,null,null,null,null,null,null,null,null,null,null,null,null,null,null,null,null,null,null,null,null,null,null,null,null,null,null,null,null,null,null,null,null,null,null,null,null,null,null,null,null,null,null,null,null,null,null,null,null,null,null,null,null,null,null,null,null,null,null,null,null,null,null,null,null,null,null,null,null,null,null,null,null,null,null,null,null,null,null,null,null,null,null,null,null,null,null,null,null,null,null,null,null,null,null,null,null,null,null,null,null,null,null,null,null,null,null,null,null,null,null,null,null,null,null,null,null,null,null,null,null,null,null,null,null,null,null,null,null,null,null,null,null,null,null,null,null,null,null,null,null,null,null,null,null,null,null,null,null,null,null,null,null,null,null,null,null,null,null,null,null,null,null,null,null,null,null,null,null,null,null,null,null,null,null,null,null,null,null,null,null,null,null,null,null,null,null,null,null,null,null,null,null,null,null,null,null,null,null,null,null,null,null,null,null,null,null,null,null,null,null,null,null,null,null,null,null,null,null,null,null,null,null,null,null,null,null,null,null,null,null,null,null,null,null,null,null,null,null,null,null,null,null,null,null,null,null,null,null,null,null,null,null,null,null,null,null,null,null,null,null,null,null,null,null,null,null,null,null,null,null,null,null,null,null,null,null,null,null,null,null,null,null,null,null,null,null,null,null,null,null,null,null,null,null,null,null,null,null,null,null,null,null,null,null,null,null,null,null,null,null,null,null,null,null,null,null,null,null,null,null,null,null,null,null,null,null,null,null,null,null,null,null,null,null,null,null,null,null,null,null,null,null,null,null,null,null,null,null,null,null,null,null,null,null,null,null,null,null,null,null,null,null,null,null,null,null,null,null,null,null,null,null,null,null,null,null,null,null,null,null,null,null,null,null,null,null,null,null,null,null,null,null,null,null,null,null,null,null,null,null,null,null,null,null,null,null,null,null,null,null,null,null,null,null,null,null,null,null,null,null,null,null,null,null,null,null,null,null,null,null,null,null,null,null,null,null,null,null,null,null,null,null,null,null,null,null,null,null,null,null,null,null,null,null,null,null,null,null,null,null,null,null,null,null,null,null,null,null,null,null,null,null,null,null,null,null,null,null,null,null,null,null,null,null,null,null,null,null,null,null,null,null,null,null,null,null,null,null,null,null,null,null,null,null,null,null,null,null,null,null,null,null,null,null,null,null,null,null,null,null,null,null,null,null,null,null,null,null,null,null,null,null,null,null,null,null,null,null,null,null,null,null,null,null,null,null,null,null,null,null,null,null,null,null,null,null,null,null,null,null,null,null,null,null,null,null,null,null,null,null,null,null,null,null,null,null,null,null,null,null,null,null,null,null,null,null,null,null,null,null,null,null,null,null,null,null,null,null,null,null,null,null,null,null,null,null,null,null,null,null,null,null,null,null,null,null,null,null,null,null,null,null,null,null,null,null,null,null,null,null,null,null,null,null,null,null,null,null,null,null,null,null,null,null,null,null,null,null,null,null,null,null,null,null,null,null,null,null,null,null,null,null,null,null,null,null,null,null,null,null,null,null,null,null,null,null,null,null,null,null,null,null,null,null,null,null,null,null,null,null,null,null,null,null,null,null,null,null,null,null,null,null,null,null,null,null,null,null,null,null,null,null,null,null,null,null,null,null,null,null,null,null,null,null,null,null,null,null,null,null,null,null,null,null,null,null,null,null,null,null,null,null,null,null,null,null,null,null,null,null,null,null,null,null,null,null,null,null,null,null,null,null,null,null,null,null,null,null,null,null,null,null,null,null,null,null,null,null,null,null,null,null,null,null,null,null,null,null,null,null,null,null,null,null,null,0]
[]
[null,null,"Arbeitsplan - Weiterentwicklung Naturverjüngung",null,null,null,null,null,null,null,null,null,null,null,null,null,null,null,null,null,null,null,null,null,null,null,null,null,null,null,"(ohne Mitwirkung der Bayerischen Forstverwaltung)",null,null,null,null,null,null,null,null,null,null,null,null,"SW",0,{"$f":"+AS6+AS7","v":0},{"$f":"+AS6+AS7+AS9","v":0},{"$f":"+AS6+AS7+AS9+AS11+AS13+AS14","v":0}]
[null,null,null,null,null,null,null,null,null,{"$f":"+IF(AU9>1,\"Nur ein Maßnahmenschlüssel zulässig!\",\"\")","v":""},null,null,null,null,null,null,null,null,null,null,null,null,null,null,null,null,null,null,null,null,null,null,null,null,null,null,null,null,null,null,null,null,null,"BW",0]
[]
[null,null,"Maßnahme:",null,null,null,null,"þ",null,520,null,"Weiterentwicklung Naturverjüngung",null,null,null,null,null,null,null,"Geplanter Beginn",null,null,null,null,null,null,null,null,null,null,"Vorauss. Fertigst.",null,null,null,null,null,null,null,null,null,null,null,null,"Kleinmaßnahme",0]
[null,null,null,null,null,null,null,null,null,null,null,null,null,null,null,null,null,null,null,"der Maßnahme",null,null,null,null,null,null,null,null,null,null,"der Maßnahme"]
[null,null,null,null,null,null,null,null,null,null,null,null,null,null,null,null,null,null,null,{"$f":"+IF(AND(I25<>\"\",W25<>\"\",AS20=1,OR(Y9=\"\",AJ9=\"\")),\"Beginn und Fertigstellung der Maßnahme pflegen!\",IF(AND(AS19=1,I25<>\"\",OR(Y9=\"\",AJ9=\"\"),OR(Arbeitsplan!D16<>\"\",Arbeitsplan!D17<>\"\",Arbeitsplan!D18<>\"\")),\"Beginn und Fertigstellung der Maßnahme pflegen!\",IF(AND(AS21=1,I25<>\"\",W25<>\"\",OR(Y9=1,AJ9=\"\")),\"Beginn und Fertigstellung der Maßnahme pflegen!\",\"\")))","v":""},null,null,null,null,null,null,null,null,null,null,null,null,null,null,null,null,null,null,null,null,null,null,null,"N2000",0,{"$f":"+AS11+AS13","v":0}]
[null,null,"Gemeinde-Bezeichnung",null,null,null,null,null,null,null,null,null,"Gemarkung-Bezeichnung",null,null,null,null,null,null,null,"Gde-/Gmkg.Nr.",null,null,null,null,null,"Fl.Nr.",null,null,null,null,"Fl.Nr.",null,null,null,null,"Fl.Nr."]
[null,null,null,null,null,null,null,null,null,null,null,null,null,null,null,null,null,null,null,null,null,null,null,"−",null,null,null,null,null,null,null,null,null,null,null,null,null,null,null,null,null,null,null,"Klein-PW",0]
[null,null,null,null,null,null,null,null,null,null,null,null,null,null,null,null,null,null,null,null,null,null,null,"−"]
[null,null,null,null,null,null,null,null,null,null,null,null,null,null,null,null,null,null,null,null,null,null,null,"−"]
[null,null,null,null,null,null,null,null,null,null,null,null,null,null,null,null,null,null,null,null,null,null,null,"−"]
[null,null,null,null,null,null,null,null,null,null,null,null,null,null,null,null,null,null,null,null,null,null,null,"−"]
[null,null,{"$f":"+IF(AND(AS22=0,I25<>\"\"),\"Maßnahme auswählen!\",\"\")","v":""},null,null,null,null,null,null,null,null,null,null,null,null,null,null,null,null,{"$f":"+IF(AT6=2,\"Unzulässige Kombination!\",IF(AND(AS20=1,AS22=1,AS9=1,W25>0.1),\"Zuschlag Kleinmaßnahme nur bei <=0,1 ha\",\"\"))","v":""},null,null,null,null,null,null,null,null,null,null,{"$f":"+IF(AND(AS19=1,AS22=1,AS13=1,I25>=20),\"Klein-PW-Zuschlag nur < 20 ha zulässig!\",IF(AND(AS20=1,AS22=1,AS13=1,W25>=20),\"Klein-PW-Zuschlag nur < 20 ha zulässig!\",\"\"))","v":""},null,null,null,null,null,null,null,null,null,null,null,null,null,null,null,null,null,null,null,"Unzulässige Nachkommastellen"]
[null,null,"Einzelmaßnahme:",null,null,null,null,null,null,null,"Sicherung und Pflege",null,null,null,null,null,null,null,null,"Erschwernis-",null,null,null,null," Schutzwald",null,null,null,null,null,"Anreiz-",null,null,null,null," N2000-Kulisse",null,null,null,null,null,null,null,"Sicherung/Pfl.",0,null,"Flächen","Laufmeter","Stück",null,"Verstreute Verj.","Nebenbauma."]
[null,null,null,null,null,null,null,null,null,null,"Verstreute Verjüngung",null,null,null,null,null,null,null,null,"zuschlag:",null,null,null,null," Bergwald",null,null,null,null,null,"zuschlag:",null,null,null,null," Klein-PW",null,null,null,null,null,null,null,"Verstreute V.",0,{"$f":"+AS20+AS21","v":0},{"$f":"+AS19","v":0},{"$f":"+AS21","v":0},{"$f":"+AS20","v":0},null,{"$f":"+IF(AND(AS20=1,AS22=1),I25,0)","v":0},{"$f":"+IF(AND(AS21=1,AS22=1),I25,0)","v":0}]
[null,null,null,null,null,null,null,null,null,null,"Erhalt von Nebenbaumarten",null,null,null,null,null,null,null,null,null,null,null,null,null," Kleinmaßnahme",null,null,null,null,null,null,null,null,null,null,null,null,null,null,null,null,null,null,"Erhalt Nebenb.",0,null,null,{"$f":"+AW20+AV20","v":0},null,null,{"$f":"INT(AY20)","v":0},{"$f":"INT(AZ20)","v":0}]
[null,null,null,null,null,null,null,null,null,null,null,null,null,null,null,null,null,null,null,null,null,null,null,null,null,null,null,null,null,null,null,null,null,null,null,null,null,null,null,null,null,null,null,null,{"$f":"SUM(AS19:AS21)","v":0},null,null,null,null,null,{"$f":"+AY20-AY21","v":0},{"$f":"+AZ20-AZ21","v":0}]
[null,null,{"$f":"+IF(AS22>1,\"Keine Mehrfachselektion zulässig!\",IF(AND(AS19=1,AS22=1,I25=\"\"),\"Fläche eintragen!\",IF(AND(AS20=1,AS22=1,I25=\"\"),\"Anzahl Stück eintragen!\",IF(AND(AS21=1,AS22=1,I25=\"\"),\"Länge eintragen!\",\"\"))))","v":""},null,null,null,null,null,null,null,null,null,null,null,null,null,null,null,null,{"$f":"+IF(AND(AS21=1,AS22=1,AS9=1),\"Unzulässiger Erschwerniszuschlag!\",IF(AND(AS19=1,AS22=1,AS9=1),\"Unzulässiger Erschwerniszuschlag!\",\"\"))","v":""},null,null,null,null,null,null,null,null,null,null,{"$f":"+IF(AND(AS21=1,AS22=1,AT11>0),\"Unzulässiger Anreizzuschlag!\",\"\")","v":""}]
[null,null,null,null,null,null,null,null,null,null,null,null,null,null,null,null,null,null,null,null,null,null,null,null,null,null,null,null,null,null,null,null,null,null,null,null,null,null,null,null,null,null,null,null,null,null,null,null,null,null,{"$f":"+AZ22+AY22","v":0}]
[null,null,{"$f":"+IF(AND(AS19=1,AS22),\"Fläche\",IF(AND(AS20=1,AS22=1),\"Anzahl\",IF(AND(AS21=1,AS22=1),\"Länge\",\"Bezugseinheit\")))","v":"Bezugseinheit"},null,null,null,null,null,null,null,null,null,null,{"$f":"+IF(AND(AS19=1,AS22=1),\" ha\",IF(AND(AS20=1,AS22=1),\" Stk.\",IF(AND(AS21=1,AS22=1),\" lfm\",\"\")))","v":""},null,null,"Maßnahmen-      fläche",null,null,null,null,null,null,null,null,null,"ha",null,null,{"$f":"+IF(AND(AS20=1,I25<>\"\",W25=\"\",AS22=1),\"Bei Maßnahme ´Verstreute Verjüngung´ zusätzlich Maßnahmenfläche eintragen!\",IF(AND(AS21=1,I25<>\"\",W25=\"\",AS22=1),\"Bei Maßnahme ´Erhalt von Nebenbaumarten´ zusätzlich Maßnahmenfläche eintragen!\",IF(AND(AS19=1,I25<>\"\",W25<>\"\"),\"Bei dieser Maßnahme ist kein zusätzlicher Flächeneintrag erforderlich!\",IF(AND(AS19=1,AT6=1),\"Der Eintrag im Feld Schutzwald bzw. Bergwald bewirkt keine erhöhte Förderung!\",\"\"))))","v":""}]
[]
[]
[]
[null,null,null,null,null,null,null,null,null,null,null,null,null,null,null,null,null,null,null,null,null,null,null,null,null,null,null,null,null,null,null,null,null,null,null,null,null,null,null,null,null,null,null,"Verstr. Verj. Stk/ha:",{"$f":"+IF(AND(AS20=1,I25<>\"\"),I25,0)","v":0},{"$f":"+W25","v":0},{"$f":"+IF(AND(AS29>0,AT29>0),AS29/AT29,0)","v":0}]
[]
[]
[null,null,{"$f":"+IF(AND(AT20=1,AS22=1,AY24>0),\"Keine Nachkommastellen zulässig!\",\"\")","v":""}]
[]
[null,null,"Förderbetrag",null,null,null,null,null,{"$f":"+IF(AND(Berechnung!Z26>0,Q34=\"\"),Berechnung!Z26,\"\")","v":""},null,null,null,null," €",null,null,{"$f":"+IF(AND(AS19=1,I25>30),\"'Sicherung und Pflege' über 30 ha nicht zulässig!\",\"\")","v":""}]
[]
[]
[]
[null,null,null,null,null,null,null,null,null,null,null,null,null,null,null,null,{"$f":"+IF(AND(Berechnung!Z26>20000,Übersicht!AS20=1),\"Förderhöchstbetrag für diese Maßnahme überschritten!\",IF(AND(Berechnung!Z26>10000,Übersicht!AS21=1),\"Förderhöchstbetrag für diese Maßnahme überschritten!\",\"\"))","v":""}]
[]
[null,null,null,null,null,null,null,null,null,null,null,null,null,null,null,null,null,null,null,null,null,null,null,null,null,null,null,null,null,null,null,null,null,null,null,null,null,"Seite 1"]
[null,"Stand: 01.01.2024"]

{"sheet":"Arbeitsplan","index":1,"n_rows":44,"n_cols":39,"rows_kept":44,"cut":false,"hidden":false,"merged":[[15,31,15,32],[9,31,9,32],[7,6,7,29],[22,31,22,32],[16,33,16,35],[17,33,17,35],[17,3,17,29],[21,6,21,29],[22,3,22,29],[8,3,8,29],[14,3,14,29],[12,3,12,29],[9,3,9,29],[10,3,10,29],[20,6,20,29],[22,33,22,35],[15,3,15,29],[23,3,23,18],[6,31,6,35],[7,31,7,32],[7,33,7,35],[20,31,20,35],[21,31,21,32],[21,33,21,35],[8,33,8,35],[8,31,8,32],[9,33,9,35],[11,33,11,35],[10,33,10,35],[12,31,14,32],[12,33,14,35],[16,31,16,32],[10,31,10,32],[2,34,2,35],[2,30,2,33],[2,27,2,29],[1,27,1,33],[1,22,1,23],[2,22,2,23],[11,3,11,29],[11,31,11,32],[24,3,24,29],[25,3,25,29],[0,1,2,1],[1,24,1,26],[2,24,2,26],[6,6,6,29],[6,2,6,5],[4,23,4,34],[4,2,4,21],[1,14,1,21],[2,14,2,21],[1,2,1,13],[2,2,2,13],[1,34,1,35],[27,33,27,35],[15,33,15,35],[26,3,26,29],[20,2,20,5],[17,31,17,32],[16,3,16,29],[23,19,23,29],[27,31,27,32],[23,33,23,35],[24,33,24,35],[25,33,25,35],[23,31,23,32],[24,31,24,32],[25,31,25,32],[26,31,26,32],[26,33,26,35],[28,3,28,29],[31,2,31,11],[38,7,38,9],[38,10,38,11],[38,20,38,27],[38,3,38,5],[32,2,32,35],[28,31,28,32],[28,33,28,35],[43,10,44,17],[43,32,44,35],[43,19,44,23],[13,3,13,25],[43,2,44,6],[37,2,37,4],[42,2,42,4],[42,19,42,21],[41,2,41,17],[41,19,41,35],[40,2,40,17],[40,19,40,35],[42,25,42,35],[42,5,42,17],[38,12,38,18],[27,3,27,29]]}
[]
[null,null,"Antragstellende",null,null,null,null,null,null,null,null,null,null,null,"Reviername",null,null,null,null,null,null,null,"Revier-        Nr. ",null,"Behörden-              Kürzel",null,null,"Reviervorgangsnummer",null,null,null,null,null,null,"lfd. Nr.            im Antrag",null,null,"Zeilenhöhe"]
[null,null,{"$f":"+IF(Übersicht!C4=\"\",\"\",Übersicht!C4)","v":""},null,null,null,null,null,null,null,null,null,null,null,{"$f":"+IF(Übersicht!P4=\"\",\"\",Übersicht!P4)","v":""},null,null,null,null,null,null,null,{"$f":"+IF(Übersicht!X4=\"\",\"\",Übersicht!X4)","v":""},null,{"$f":"+IF(Übersicht!Z4=\"\",\"\",Übersicht!Z4)","v":""},null,null,{"$f":"+IF(Übersicht!AD4=\"\",\"\",Übersicht!AD4)","v":""},null,null,{"$f":"+IF(Übersicht!AH4=\"\",\"\",Übersicht!AH4)","v":""},null,null,null,{"$f":"+IF(Übersicht!AL4=\"\",\"\",Übersicht!AL4)","v":""},null,null,"Zeilenhöhe"]
[]
[null,null,"Arbeitsplan - Weiterentwicklung Naturverjüngung",null,null,null,null,null,null,null,null,null,null,null,null,null,null,null,null,null,null,null,null,"(ohne Mitwirkung der Bayerischen Forstverwaltung)"]
[]
[null,null,"Auflagen:",null,null,null,"Folgende Maßnahmen sind vor einer Auszahlung durchzuführen.",null,null,null,null,null,null,null,null,null,null,null,null,null,null,null,null,null,null,null,null,null,null,null,null,"Prüfvermerk AELF"]
[null,null,null,null,null,null,"Die Durchführung ist mit dem Verwendungsnachweis / der Fertigstellungsanzeige anzuzeigen.",null,null,null,null,null,null,null,null,null,null,null,null,null,null,null,null,null,null,null,null,null,null,null,null,"i.O.",null,"weitere Auflagen nachfolgend"]
[{"$f":"+IF(Übersicht!AS19=1,1,0)","v":0},null,{"$f":"+IF(A9=1,\"þ\",\"\")","v":""},{"$f":"+IF(A9=1,\"Maßnahmen, bei denen Kunststoffe dauerhaft im Wald verbleiben (z.B. Superabsorber, Ballenpflanzen mit Kunststoffgitternetz, Bitumenpappe etc.), schließen die Förderung der Gesamtmaßnahme aus.\",\"\")","v":""},null,null,null,null,null,null,null,null,null,null,null,null,null,null,null,null,null,null,null,null,null,null,null,null,null,null,null,{"$f":"+IF(A9=1,\"q\",\"\")","v":""},null,{"$f":"+IF(A9=1,\"q\",\"\")","v":""},null,null,null,"Zeilenhöhe"]
[{"$f":"+IF(Übersicht!AS21=1,1,0)","v":0},null,{"$f":"+IF(A10=1,\"þ\",\"\")","v":""},{"$f":"+IF(A10=1,\"Bau und Kontrolle eines Wildschutzzaunes, der die Naturverjüngung zuverlässig gegen im Revier vorkommendes Schalenwild schützt.\" &\n\" Der in Zusammenhang mit dieser Auflage ergangene Bewilligungsbescheid ersetzt die u.U. notwendige baurechtliche Genehmigung nicht.\",\"\")","v":""},null,null,null,null,null,null,null,null,null,null,null,null,null,null,null,null,null,null,null,null,null,null,null,null,null,null,null,{"$f":"+IF(A10=1,\"q\",\"\")","v":""},null,{"$f":"+IF(A10=1,\"q\",\"\")","v":""}]
[{"$f":"+IF(Übersicht!AS21=1,1,0)","v":0},null,{"$f":"+IF(A11=1,\"þ\",\"\")","v":""},{"$f":"+IF(A11=1,\"Der Wildschutzzaun muss mindestens ein Tor oder einen Überstieg umfassen.\",\"\")","v":""},null,null,null,null,null,null,null,null,null,null,null,null,null,null,null,null,null,null,null,null,null,null,null,null,null,null,null,{"$f":"+IF(A10=1,\"q\",\"\")","v":""},null,{"$f":"+IF(A10=1,\"q\",\"\")","v":""}]
[{"$f":"+IF(Übersicht!AS21=1,1,0)","v":0},null,{"$f":"+IF(A12=1,\"þ\",\"\")","v":""},{"$f":"+IF(A12=1,\"Zäune dürfen nicht an bestehende Zäune anschließen.\",\"\")","v":""},null,null,null,null,null,null,null,null,null,null,null,null,null,null,null,null,null,null,null,null,null,null,null,null,null,null,null,{"$f":"+IF(A11=1,\"q\",\"\")","v":""},null,{"$f":"+IF(A11=1,\"q\",\"\")","v":""}]
[{"$f":"+IF(Übersicht!AS20=1,1,0)","v":0},null,{"$f":"+IF(A13=1,\"þ\",\"\")","v":""},{"$f":"+IF(A13=1,\"Die verstreute Verjüngung muss zuverlässig durch Einzelschutz gegen Wildverbiss geschützt werden durch die Verwendung von\",\"\")","v":""},null,null,null,null,null,null,null,null,null,null,null,null,null,null,null,null,null,null,null,null,null,null,null,null,null,null,null,{"$f":"+IF(A13=1,\"q\",\"\")","v":""},null,{"$f":"+IF(A24=1,\"q\",\"\")","v":""},null,null,null,null,"Drahtgitterhosen."]
[{"$f":"+IF(Übersicht!AS20=1,1,0)","v":0},null,null,null,null,null,null,null,null,null,null,null,null,null,null,null,null,null,null,null,null,null,null,null,null,null,null,null,null,null,null,null,null,null,null,null,{"$f":"+IF(AND(D13<>\"\",D14=\"\"),\"Bitte ergänzen!\",\"\")","v":""},null,"Wuchshüllen (nicht aus oder unter Beteiligung von Kunststoffen oder Biokunststoffen)."]
[{"$f":"+IF(Übersicht!AS20=1,1,0)","v":0},null,null,{"$f":"+IF(A13=1,\"Ein chemischer Verbissschutz (Streichen) oder Schutz der Terminaltriebe (Klammern) ist nicht förderfähig.\",\"\")","v":""},null,null,null,null,null,null,null,null,null,null,null,null,null,null,null,null,null,null,null,null,null,null,null,null,null,null,null,null,null,null,null,null,null,null,"Wuchsgittern (nicht aus oder unter Beteiligung von Kunststoffen oder Biokunststoffen)."]
[null,null,{"$f":"+IF(D16=\"\",\"o\",\"þ\")","v":"o"},null,null,null,null,null,null,null,null,null,null,null,null,null,null,null,null,null,null,null,null,null,null,null,null,null,null,null,null,"q",null,"q",null,null,null,{"$f":"+D16","v":0}]
[null,null,{"$f":"+IF(D17=\"\",\"o\",\"þ\")","v":"o"},null,null,null,null,null,null,null,null,null,null,null,null,null,null,null,null,null,null,null,null,null,null,null,null,null,null,null,null,"q",null,"q",null,null,null,{"$f":"+D17","v":0}]
[null,null,{"$f":"+IF(D18=\"\",\"o\",\"þ\")","v":"o"},null,null,null,null,null,null,null,null,null,null,null,null,null,null,null,null,null,null,null,null,null,null,null,null,null,null,null,null,"q",null,"q",null,null,null,{"$f":"+D18","v":0}]
[]
[]
[null,null,"Auflagen:",null,null,null,"Folgende Maßnahmen sind während der Bindefrist durchzuführen / einzuhalten.",null,null,null,null,null,null,null,null,null,null,null,null,null,null,null,null,null,null,null,null,null,null,null,null,"Prüfvermerk AELF"]
[null,null,null,null,null,null,"Dabei sind Notwendigkeit, Umfang und Zeitpunkt vorab mit dem zuständigen Revierleiter abzustimmen.",null,null,null,null,null,null,null,null,null,null,null,null,null,null,null,null,null,null,null,null,null,null,null,null,"i.O.",null,"weitere Auflagen nachfolgend"]
[{"$f":"+IF(Übersicht!AS19=1,1,0)","v":0},null,{"$f":"+IF(A23=1,\"þ\",\"\")","v":""},{"$f":"+IF(A23=1,\"Maßnahmen, bei denen Kunststoffe dauerhaft im Wald verbleiben (z.B. Superabsorber, Ballenpflanzen mit Kunststoffgitternetz, Bitumenpappe etc.), schließen die Förderung der Gesamtmaßnahme aus.\",\"\")","v":""},null,null,null,null,null,null,null,null,null,null,null,null,null,null,null,null,null,null,null,null,null,null,null,null,null,null,null,{"$f":"+IF(A23=1,\"q\",\"\")","v":""},null,{"$f":"+IF(A23=1,\"q\",\"\")","v":""},null,null,null,"Zeilenhöhe"]
[{"$f":"+IF(Übersicht!AS20=1,1,0)","v":0},null,{"$f":"+IF(A24=1,\"þ\",\"\")","v":""},{"$f":"+IF(Übersicht!AS20=1,\"Die Förderung umfasst Schutz und Pflege der verstreuten Verjüngung aus:\",\"\")","v":""},null,null,null,null,null,null,null,null,null,null,null,null,null,null,null,null,null,null,null,null,null,null,null,null,null,null,null,{"$f":"+IF(A24=1,\"q\",\"\")","v":""},null,{"$f":"+IF(A24=1,\"q\",\"\")","v":""},null,null,{"$f":"+IF(AND(D24<>\"\",T24=\"\"),\"Bitte Baumarten ergänzen!\",\"\")","v":""}]
[{"$f":"+IF(Übersicht!AS20=1,1,0)","v":0},null,{"$f":"+IF(A25=1,\"þ\",\"\")","v":""},{"$f":"+IF(Übersicht!AS20=1,\"Die verstreute Verjüngung muss während der Bindefrist zuverlässig durch Einzelschutz gegen Wildverbiss geschützt werden.\" & \" Ein chemischer Verbissschutz (Streichen)  oder Schutz der Terminaltriebe (Klammern) ist nicht förderfähig.\",\"\")","v":""},null,null,null,null,null,null,null,null,null,null,null,null,null,null,null,null,null,null,null,null,null,null,null,null,null,null,null,{"$f":"+IF(A25=1,\"q\",\"\")","v":""},null,{"$f":"+IF(A25=1,\"q\",\"\")","v":""}]
[{"$f":"+IF(Übersicht!AS20=1,1,0)","v":0},null,{"$f":"+IF(A26=1,\"þ\",\"\")","v":""},{"$f":"+IF(Übersicht!AS20=1,\"Die verstreute Verjüngung ist während der Bindefrist durch Entnahme bedrängender Konkurrenzvegetation zu pflegen.\",\"\")","v":""},null,null,null,null,null,null,null,null,null,null,null,null,null,null,null,null,null,null,null,null,null,null,null,null,null,null,null,{"$f":"+IF(A26=1,\"q\",\"\")","v":""},null,{"$f":"+IF(A26=1,\"q\",\"\")","v":""}]
[null,null,{"$f":"+IF(D27=\"\",\"o\",\"þ\")","v":"o"},null,null,null,null,null,null,null,null,null,null,null,null,null,null,null,null,null,null,null,null,null,null,null,null,null,null,null,null,"q",null,"q",null,null,null,{"$f":"+D27","v":0}]
[null,null,{"$f":"+IF(D28=\"\",\"o\",\"þ\")","v":"o"},null,null,null,null,null,null,null,null,null,null,null,null,null,null,null,null,null,null,null,null,null,null,null,null,null,null,null,null,"q",null,"q",null,null,null,{"$f":"+D28","v":0}]
[null,null,{"$f":"+IF(D29=\"\",\"o\",\"þ\")","v":"o"},null,null,null,null,null,null,null,null,null,null,null,null,null,null,null,null,null,null,null,null,null,null,null,null,null,null,null,null,"q",null,"q",null,null,null,{"$f":"+D29","v":0}]
[]
[]
[null,null,"Weitere Auflagen des AELF"]
[null,null,"Aufgrund der örtlichen Gegebenheiten werden zur Weiterentwicklung der Naturverjüngung folgende Maßnahmen festgesetzt:"]
[null,null,"q"]
[null,null,"q"]
[null,null,"q"]
[]
[null,null," Anlagen:"]
[null,null,"þ","Lageplan",null,null,"þ","Flurkarte",null,null,{"$f":"+IF(M39=\"\",\"o\",\"þ\")","v":"o"},null,null,null,null,null,null,null,null,{"$f":"+IF(U39=\"\",\"o\",\"þ\")","v":"o"}]
[]
[null,null,"Durch den/die Antragstellende/n erstellt:                  \n",null,null,null,null,null,null,null,null,null,null,null,null,null,null,null,null,"Durch die staatl. Revierleitung geprüft und festgesetzt:                    \n"]
[null,null,null,null,null,null,null,null,null,null,null,null,null,null,null,null,null,null,null,null,null,null,null,null,null,null,null,null,null,null,null,null,null,null,null,null,null,"Zeilenhöhe"]
[null,null,"Datum",null,null,"Unterschrift/en Antragstellende, Bevollmächtigte*  ",null,null,null,null,null,null,null,null,null,null,null,null,null,"Datum",null,null,null,null,null,"Unterschrift Revierleitung / Amtsbezeichnung"]
[null,null,{"$f":"+Übersicht!B41","v":"Stand: 01.01.2024"},null,null,null,null,null,null,null,"* bitte Funktion angeben",null,null,null,null,null,null,null,null,null,null,null,null,null,null,null,null,null,null,null,null,null,"Seite 2"]

{"sheet":"Berechnung","index":2,"n_rows":29,"n_cols":30,"rows_kept":29,"cut":false,"hidden":false,"merged":[[1,2,1,8],[2,2,2,8],[1,22,1,23],[2,22,2,23],[1,18,1,21],[1,16,1,17],[2,16,2,17],[2,18,2,20],[1,14,1,15],[2,14,2,15],[1,9,1,13],[2,9,2,13],[11,27,12,27],[11,28,12,28],[11,29,12,29],[16,3,16,9],[16,13,16,15],[16,16,16,18],[13,10,13,11],[13,13,13,15],[13,16,13,18],[15,16,15,18],[13,2,13,9],[15,5,15,7],[11,3,11,9],[15,13,15,15],[14,13,14,15],[14,16,14,18],[20,16,20,18],[20,10,20,11],[21,3,21,9],[21,10,21,11],[22,10,22,11],[20,2,20,8],[16,10,16,11],[8,13,8,15],[8,16,8,18],[12,16,12,18],[12,20,12,21],[11,10,11,11],[10,13,10,15],[11,13,11,15],[9,16,9,18],[10,16,10,18],[11,16,11,18],[9,10,9,11],[10,10,10,11],[27,27,27,28],[26,2,26,5],[18,20,18,21],[21,13,21,15],[22,13,22,15],[21,16,21,18],[22,16,22,18],[18,13,18,15],[18,16,18,18],[22,5,22,7],[18,3,18,9],[18,10,18,11],[24,2,25,6],[24,7,25,10],[26,22,26,23],[20,13,20,15],[6,2,7,19],[8,2,8,9],[3,2,5,23],[8,10,8,11],[26,27,26,28],[17,13,17,15],[17,16,17,18],[10,3,10,9],[9,3,9,9],[9,13,9,15],[14,3,14,9],[15,3,15,4],[17,3,17,9],[14,10,14,11],[15,10,15,11],[17,10,17,11]]}
[]
[null,null,"Antragstellende",null,null,null,null,null,null,"Reviername",null,null,null,null,"Revier-            Nr. ",null,"Behörden-    Kürzel",null,"Reviervorgangsnummer",null,null,null,"lfd. Nr.                      im Antrag"]
[null,null,{"$f":"+IF(Übersicht!C4=\"\",\"\",Übersicht!C4)","v":""},null,null,null,null,null,null,{"$f":"+IF(Übersicht!P4=\"\",\"\",Übersicht!P4)","v":""},null,null,null,null,{"$f":"+IF(Übersicht!X4=\"\",\"\",Übersicht!X4)","v":""},null,{"$f":"+IF(Übersicht!Z4=\"\",\"\",Übersicht!Z4)","v":""},null,{"$f":"+IF(Übersicht!AD4=\"\",\"\",Übersicht!AD4)","v":""},null,null,{"$f":"+IF(Übersicht!AH4=\"\",\"\",Übersicht!AH4)","v":""},{"$f":"+IF(Übersicht!AL4=\"\",\"\",Übersicht!AL4)","v":""}]
[null,null,"Berechnung des Förderbetrages"]
[]
[]
[null,null,"Weiterentwicklung Naturverjüngung"]
[null,null,null,null,null,null,null,null,null,null,null,null,null,null,null,null,null,null,null,null,null,null,null,null,null,null,null,null,520,"Kombi Fehler"]
[null,null,"Sicherung und Pflege",null,null,null,null,null,null,null,{"$f":"+IF(AND(Übersicht!AS19=1,Übersicht!AS22=1),\"€/ha\",\"\")","v":""},null,null,{"$f":"+IF(AND(Übersicht!AS19=1,Übersicht!AS22=1),\"Fläche\",\"\")","v":""},null,null,{"$f":"+IF(AND(Übersicht!AS19=1,Übersicht!AS22=1),\"ergibt €\",\"\")","v":""},null,null,null,null,null,null,null,null,null,null,"Sicherung/Pflege",1200,{"$f":"+IF(AND(Übersicht!AS19=1,Übersicht!AS22>1),1,0)","v":0}]
[null,null,null,"Grundfördersatz",null,null,null,null,null,null,{"$f":"+IF(AND(Übersicht!AS19=1,Übersicht!AS22=1,AD29=0),AC9,\"\")","v":""},null,null,{"$f":"+IF(AND(Übersicht!AS19=1,Übersicht!AS22=1,AD29=0,Übersicht!I25<>\"\"),Übersicht!I25,\"\")","v":""},null,null,{"$f":"+IF(N10<>\"\",N10*K10,\"\")","v":""},null,null,null,null,null,null,null,null,{"$f":"+IF(Q10=\"\",0,Q10)","v":0},null,"Klein-PW",120,{"$f":"+IF(AND(Übersicht!AS19=1,Übersicht!AS22=1,Übersicht!AS13=1,Übersicht!I25>=20),1,0)","v":0}]
[null,null,null,"N2000",null,null,null,null,null,null,{"$f":"+IF(AND(Übersicht!AS19=1,Übersicht!AS22=1,Übersicht!AT11<2,AD29=0),AC11,IF(AND(Übersicht!AS19=1,Übersicht!AS22=1,Übersicht!AT11=2,AD29=0),AC12,\"\"))","v":""},null,null,{"$f":"+IF(AND(Übersicht!AS19=1,Übersicht!AS22=1,Übersicht!AS11=1,AD29=0,Übersicht!I25<>\"\"),Übersicht!I25,\"\")","v":""},null,null,{"$f":"+IF(N11<>\"\",N11*K11,\"\")","v":""},null,null,null,null,null,null,null,null,{"$f":"+IF(Q11=\"\",0,Q11)","v":0},null,"N2000",120,0]
[null,null,null,"Klein-PW",null,null,null,null,null,null,{"$f":"+IF(AND(Übersicht!AS19=1,Übersicht!AS22=1,Übersicht!AT11<2,AD29=0),AC10,IF(AND(Übersicht!AS19=1,Übersicht!AS22=1,Übersicht!AT11=2,AD29=0),AC12,\"\"))","v":""},null,null,{"$f":"+IF(AND(Übersicht!AS19=1,Übersicht!AS22=1,Übersicht!AS13=1,AD29=0,Übersicht!I25<>\"\"),Übersicht!I25,\"\")","v":""},null,null,"",null,null,null,null,null,null,null,null,0,null,"N2000+KleinPW",60,0]
[]
[null,null,"Verstreute Verjüngung",null,null,null,null,null,null,null,{"$f":"+IF(AND(Übersicht!AS20=1,Übersicht!AS22=1),\"€/Stk.\",\"\")","v":""},null,null,{"$f":"+IF(AND(Übersicht!AS20=1,Übersicht!AS22=1),\"Anzahl Stück\",\"\")","v":""},null,null,{"$f":"+IF(AND(Übersicht!AS20=1,Übersicht!AS22=1),\"ergibt €\",\"\")","v":""},null,null,null,null,null,null,null,null,null,null,"SW/BW",0,{"$f":"+IF(AND(Übersicht!AS20=1,Übersicht!AT6=2),1,0)","v":0}]
[null,null,null,"Grundfördersatz",null,null,null,null,null,null,{"$f":"+IF(AND(Übersicht!AS20=1,Übersicht!AS22=1,AD29=0),AC16,\"\")","v":""},null,null,{"$f":"+IF(AND(Übersicht!AS20=1,Übersicht!AS22=1,AD29=0,Übersicht!I25<>\"\"),Übersicht!I25,\"\")","v":""},null,null,{"$f":"+IF(N15<>\"\",N15*K15,\"\")","v":""},null,null,null,null,null,null,null,null,{"$f":"+IF(Q15=\"\",0,Q15)","v":0},null,"Kleinmaßnahme",0,{"$f":"+IF(AND(Übersicht!AS19=1,Übersicht!AS9=1),1,0)","v":0}]
[null,null,null,"Kulisse:",null,{"$f":"+IF(AND(Übersicht!AS20=1,Übersicht!AS22=1,Übersicht!AT6=1,Übersicht!AS6=1),\"Schutzwald\",IF(AND(Übersicht!AS20=1,Übersicht!AS22=1,Übersicht!AT6=1,Übersicht!AS7=1),\"Bergwald\",\"\"))","v":""},null,null,null,null,{"$f":"+IF(AND(Übersicht!AS20=1,Übersicht!AS22=1,AD29=0),AC17,\"\")","v":""},null,null,{"$f":"+IF(AND(Übersicht!AS20=1,Übersicht!AS22=1,AD29=0,Übersicht!I25<>\"\",Übersicht!AT6=1),Übersicht!I25,\"\")","v":""},null,null,{"$f":"+IF(N16<>\"\",N16*K16,\"\")","v":""},null,null,null,null,null,null,null,null,0,null,"Verstreute Verjüng.",4,{"$f":"+IF(AND(Übersicht!AS20=1,Übersicht!AS22>1),1,0)","v":0}]
[null,null,null,"Kleinmaßnahme",null,null,null,null,null,null,{"$f":"+IF(AND(Übersicht!AS20=1,Übersicht!AS22=1,AD29=0),AC18,\"\")","v":""},null,null,{"$f":"+IF(AND(Übersicht!AS20=1,Übersicht!AS22=1,AD29=0,Übersicht!I25<>\"\",Übersicht!AS9=1),Übersicht!I25,\"\")","v":""},null,null,{"$f":"+IF(N17<>\"\",N17*K17,\"\")","v":""},null,null,null,null,null,null,null,null,0,null,"SW/BW",1.6,{"$f":"+IF(AND(Übersicht!AS20=1,Übersicht!AT6=2),1,0)","v":0}]
[null,null,null,"N2000",null,null,null,null,null,null,{"$f":"+IF(AND(Übersicht!AS20=1,Übersicht!AS22=1,Übersicht!AT11<2,AD29=0),AC19,IF(AND(Übersicht!AS20=1,Übersicht!AS22=1,Übersicht!AT11=2,AD29=0),AC21,\"\"))","v":""},null,null,{"$f":"+IF(AND(Übersicht!AS20=1,Übersicht!AS22=1,AD29=0,Übersicht!I25<>\"\",Übersicht!AS11=1),Übersicht!I25,\"\")","v":""},null,null,{"$f":"+IF(N18<>\"\",ROUNDDOWN(N18*K18,2),\"\")","v":""},null,null,null,null,null,null,null,null,0,null,"Kleinmaßnahme",0.4,{"$f":"+IF(AND(Übersicht!AS20=1,Übersicht!AS22=1,Übersicht!AS9=1,Übersicht!W25>0.1),1,0)","v":0}]
[null,null,null,"Klein-PW",null,null,null,null,null,null,{"$f":"+IF(AND(Übersicht!AS20=1,Übersicht!AS22=1,Übersicht!AT11<2,AD29=0),AC20,IF(AND(Übersicht!AS20=1,Übersicht!AS22=1,Übersicht!AT11=2,AD29=0),AC21,\"\"))","v":""},null,null,{"$f":"+IF(AND(Übersicht!AS20=1,Übersicht!AS22=1,AD29=0,Übersicht!I25<>\"\",Übersicht!AS13=1),Übersicht!I25,\"\")","v":""},null,null,{"$f":"+IF(N19<>\"\",ROUNDDOWN(N19*K19,2),\"\")","v":""},null,null,null,null,null,null,null,null,0,null,"N2000",0.4]
[null,null,null,null,null,null,null,null,null,null,null,null,null,null,null,null,null,null,null,null,null,null,null,null,null,null,null,"Klein-PW",0.4,{"$f":"+IF(AND(Übersicht!AS20=1,Übersicht!AS13=1,Übersicht!W25>=20),1,0)","v":0}]
[null,null,"Erhalt von Nebenbaumarten",null,null,null,null,null,null,null,{"$f":"+IF(AND(Übersicht!AS21=1,Übersicht!AS22=1),\"€/lfm\",\"\")","v":""},null,null,{"$f":"+IF(AND(Übersicht!AS21=1,Übersicht!AS22=1),\"Laufmeter\",\"\")","v":""},null,null,{"$f":"+IF(AND(Übersicht!AS21=1,Übersicht!AS22=1),\"ergibt €\",\"\")","v":""},null,null,null,null,null,null,null,null,null,null,"N2000+KleinPW",0.2,0]
[null,null,null,"Grundfördersatz",null,null,null,null,null,null,{"$f":"+IF(AND(Übersicht!AS21=1,Übersicht!AS22=1,AD29=0),AC22,\"\")","v":""},null,null,{"$f":"+IF(AND(Übersicht!AS21=1,Übersicht!AS22=1,AD29=0,Übersicht!I25<>\"\"),Übersicht!I25,\"\")","v":""},null,null,{"$f":"+IF(N22<>\"\",N22*K22,\"\")","v":""},null,null,null,null,null,null,null,null,{"$f":"+IF(Q22=\"\",0,Q22)","v":0},null,"Nebenbaumarten",5,{"$f":"+IF(AND(Übersicht!AS21=1,Übersicht!AS22>1),1,0)","v":0}]
[null,null,null,"Kulisse:",null,{"$f":"+IF(AND(Übersicht!AS21=1,Übersicht!AS22=1,Übersicht!AT6=1,Übersicht!AS6=1),\"Schutzwald\",IF(AND(Übersicht!AS21=1,Übersicht!AS22=1,Übersicht!AT6=1,Übersicht!AS7=1),\"Bergwald\",\"\"))","v":""},null,null,null,null,{"$f":"+IF(AND(Übersicht!AS21=1,Übersicht!AS22=1,AD29=0),AC23,\"\")","v":""},null,null,{"$f":"+IF(AND(Übersicht!AS21=1,Übersicht!AS22=1,Übersicht!AT6=1,AD29=0,Übersicht!I25<>\"\"),Übersicht!I25,\"\")","v":""},null,null,{"$f":"+IF(N23<>\"\",N23*K23,\"\")","v":""},null,null,null,null,null,null,null,null,0,null,"SW/BW",2,{"$f":"+IF(AND(Übersicht!AS21=1,Übersicht!AT6=2),1,0)","v":0}]
[null,null,null,null,null,null,null,null,null,null,null,null,null,null,null,null,null,null,null,null,null,null,null,null,null,null,null,"Kleinmaßnahme",2,{"$f":"+IF(AND(Übersicht!AS21=1,Übersicht!AS9=1),1,0)","v":0}]
[null,null,"Förderbetrag €:",null,null,null,null,{"$f":"+IF(Z26=0,\"\",Z26)","v":""},null,null,null,null,null,null,null,null,null,null,null,null,null,null,null,null,null,null,null,"N2000",2,{"$f":"+IF(AND(Übersicht!AS21=1,Übersicht!AS11=1),1,0)","v":0}]
[null,null,null,null,null,null,null,null,null,null,null,null,null,null,null,null,null,null,null,null,null,null,null,null,null,{"$f":"+IF(Z10+Z11+Z12+Z15+Z16+Z17+Z18+Z19+Z22+Z23=0,0,Z10+Z11+Z12+Z15+Z16+Z17+Z18+Z19+Z22+Z23)","v":0},null,"Klein-PW",2,{"$f":"+IF(AND(Übersicht!AS21=1,Übersicht!AS13=1),1,0)","v":0}]
[null,null,{"$f":"+Übersicht!B41","v":"Stand: 01.01.2024"},null,null,null,null,null,null,null,null,null,null,null,null,null,null,null,null,null,null,null,"Seite 3",null,null,null,null,"Unzul. Nachkommastellen",null,{"$f":"+IF(Übersicht!AY24>0,1,0)","v":0}]
[null,null,null,null,null,null,null,null,null,null,null,null,null,null,null,null,null,null,null,null,null,null,null,null,null,null,null,"Falscher/Fehlender Flächeneintrag",null,{"$f":"+IF(AND(OR(Übersicht!AS21=1,Übersicht!AS20=1),Übersicht!AS22=1,Übersicht!W25=\"\"),1,IF(AND(Übersicht!AS19=1,Übersicht!AS22=1,Übersicht!W25<>\"\"),1,0))","v":0}]
[null,null,null,null,null,null,null,null,null,null,null,null,null,null,null,null,null,null,null,null,null,null,null,null,null,null,null,null,null,{"$f":"SUM(AD9:AD28)","v":0}]

{"sheet":"Lageplan","index":3,"n_rows":36,"n_cols":10,"rows_kept":36,"cut":false,"hidden":false,"merged":[[3,1,5,2],[0,0,2,0],[1,9,1,10],[2,9,2,10],[1,2,1,4],[2,2,2,4]]}
[]
[null,"Antragstellende","Reviername",null,null,"Revier-                  Nr. ","Behörden-   Kürzel","Reviervorgangsnummer",null,"lfd. Nr.                          Im Antrag"]
[null,{"$f":"+IF(Übersicht!C4=\"\",\"\",Übersicht!C4)","v":""},{"$f":"+IF(Übersicht!P4=\"\",\"\",Übersicht!P4)","v":""},null,null,{"$f":"+IF(Übersicht!X4=\"\",\"\",Übersicht!X4)","v":""},{"$f":"+IF(Übersicht!Z4=\"\",\"\",Übersicht!Z4)","v":""},{"$f":"+IF(Übersicht!AD4=\"\",\"\",Übersicht!AD4)","v":""},{"$f":"+IF(Übersicht!AH4=\"\",\"\",Übersicht!AH4)","v":""},{"$f":"+IF(Übersicht!AL4=\"\",\"\",Übersicht!AL4)","v":""}]
[null,"Lageplan"]
[]
[]
[]
[]
[]
[]
[]
[]
[]
[]
[]
[]
[]
[]
[]
[]
[]
[]
[]
[]
[]
[]
[]
[]
[]
[]
[]
[]
[]
[]
[]
[null,{"$f":"+Übersicht!B41","v":"Stand: 01.01.2024"}]

{"sheet":"Flurkarte","index":4,"n_rows":36,"n_cols":10,"rows_kept":36,"cut":false,"hidden":false,"merged":[[3,1,5,2],[0,0,2,0],[1,2,1,4],[1,9,1,10],[2,2,2,4],[2,9,2,10]]}
[]
[null,"Antragstellende","Reviername",null,null,"Revier-                  Nr. ","Behörden-   Kürzel","Reviervorgangsnummer",null,"lfd. Nr.                          Im Antrag"]
[null,{"$f":"+IF(Übersicht!C4=\"\",\"\",Übersicht!C4)","v":""},{"$f":"+IF(Übersicht!P4=\"\",\"\",Übersicht!P4)","v":""},null,null,{"$f":"+IF(Übersicht!X4=\"\",\"\",Übersicht!X4)","v":""},{"$f":"+IF(Übersicht!Z4=\"\",\"\",Übersicht!Z4)","v":""},{"$f":"+IF(Übersicht!AD4=\"\",\"\",Übersicht!AD4)","v":""},{"$f":"+IF(Übersicht!AH4=\"\",\"\",Übersicht!AH4)","v":""},{"$f":"+IF(Übersicht!AL4=\"\",\"\",Übersicht!AL4)","v":""}]
[null,"Flurkarte"]
[]
[]
[]
[]
[]
[]
[]
[]
[]
[]
[]
[]
[]
[]
[]
[]
[]
[]
[]
[]
[]
[]
[]
[]
[]
[]
[]
[]
[]
[]
[]
[null,{"$f":"+Übersicht!B41","v":"Stand: 01.01.2024"}]

{"sheet":"Erläuterung","index":5,"n_rows":21,"n_cols":12,"rows_kept":21,"cut":false,"hidden":false,"merged":[[3,1,5,12],[6,1,19,12],[1,11,1,12],[2,11,2,12],[1,7,1,8],[2,7,2,8],[2,2,2,5],[1,2,1,5]]}
[]
[null,"Antragstellende","Reviername",null,null,null,"Revier-               Nr. ","Behörden-   Kürzel",null,"Reviervorgangsnummer",null,"lfd. Nr.                    im Antrag"]
[null,{"$f":"+IF(Übersicht!C4=\"\",\"\",Übersicht!C4)","v":""},{"$f":"+IF(Übersicht!P4=\"\",\"\",Übersicht!P4)","v":""},null,null,null,{"$f":"+IF(Übersicht!X4=\"\",\"\",Übersicht!X4)","v":""},{"$f":"+IF(Übersicht!Z4=\"\",\"\",Übersicht!Z4)","v":""},null,{"$f":"+IF(Übersicht!AD4=\"\",\"\",Übersicht!AD4)","v":""},{"$f":"+IF(Übersicht!AH4=\"\",\"\",Übersicht!AH4)","v":""},{"$f":"+IF(Übersicht!AL4=\"\",\"\",Übersicht!AL4)","v":""}]
[null,"Empfehlungen, Begründungen, Erläuterungen, Anmerkungen, Bestandbeschreibung"]
[]
[]
[]
[]
[]
[]
[]
[]
[]
[]
[]
[]
[]
[]
[]
[]
[null,{"$f":"+Übersicht!B41","v":"Stand: 01.01.2024"}]

{"sheet":"Auswahl","index":6,"n_rows":20,"n_cols":4,"rows_kept":20,"cut":false,"hidden":false,"merged":[]}
[null,"Auflagen vor der Auszahlung",null,"Anlagen"]
[]
["Sicherung und Pflege:","Bau und Kontrolle eines Wildschutzzaunes, der die Naturverjüngung zuverlässig gegen im Revier vorkommendes Schalenwild schützt. Der in Zusammenhang mit dieser Auflage ergangene Bewilligungsbescheid ersetzt die u.U. notwendige baurechtliche Genehmigung nicht.",null,"Flächenskizze"]
[null,"Schutz und Sicherung der vereinzelt aufgekommenen _________ gegen Wildverbiss. Der Verbissschutz sollte möglichst nicht aus Kunststoff, sondern aus nachwachsenden Rohstoffen gefertigt sein.",null,"GNSS-Ausdruck"]
[null,"Die NVJ ist zu pflegen. Dabei sind die klimatoleranten Baumarten _____ zu fördern. ",null,"LAFIS-Ausdruck"]
[null,"Fehlstellen sind auszupflanzen mit (Baumarten/Herkunft)________________ und gegen Wildverbiss zu schützen.",null,"BayWIS-Ausdruck"]
[null,"Freistellen der vereinzelt aufgekommenen __________ . "]
[null,"Schutz und Sicherung der _________ durch Wuchsgitter / Wuchshüllen. Der Verbissschutz sollte möglichst nicht aus Kunststoff, sondern aus nachwachsenden Rohstoffen gefertigt sein."]
[]
[]
[]
[]
[]
[]
[null,"Auflagen während der Bindefrist"]
[]
["Sicherung und Pflege:","Die NVJ ist während der Bindefrist mindestens einmal zu pflegen. Dabei sind die klimatoleranten Baumarten zu fördern."]
[null,"Der beschattende Altschirm ist während der Bindefrist zurückzunehmen / zu entfernen."]
[null,"Freistellen der vereinzelt aufgekommenen __________ . "]
[null,"Schutz und Sicherung der vereinzelt aufkommenden _________ gegen Wildverbiss. Der Verbissschutz sollte möglichst nicht aus Kunststoff, sondern aus nachwachsenden Rohstoffen gefertigt sein."]

{"sheet":"Organisation","index":7,"n_rows":8731,"n_cols":8,"rows_kept":8731,"cut":false,"hidden":false,"merged":[]}
[null,"Gemeindebezeichnung","Gemarkungsbezeichung","Gemeindes.","Gemarkung",{"$f":"SUM(F2:F8731)","v":0}]
[null,"ABENBERG","ABENBERG",576111,3801,{"$f":"+IF(A2<>\"\",1,\"\")","v":""},null,"ABENBERG"]
[null,"ABENBERG","AURAU",576111,3808,"",null,"ABENBERG"]
[null,"ABENBERG","BEERBACH",576111,3810,"",null,"ABENBERGER WALD"]
[null,"ABENBERG","DÜRRENMUNGENAU",576111,3817,"",null,"ABENSBERG"]
[null,"ABENBERG","EBERSBACH",576111,3819,"",null,"ABSBERG"]
[null,"ABENBERG","OBERSTEINBACH OB GMÜND",576111,3871,"",null,"ABTSWIND"]
[null,"ABENBERG","WASSERMUNGENAU",576111,3914,"",null,"ACHSLACH"]
[null,"ABENBERGER WALD","ABENBERGER WALD",576451,3802,"",null,"ADELSCHLAG"]
[null,"ABENSBERG","ABENSBERG",273111,6001,"",null,"ADELSDORF"]
[null,"ABENSBERG","ARNHOFEN",273111,6008,"",null,"ADELSHOFEN"]
[null,"ABENSBERG","HÖRLBACH",273111,6036,"",null,"ADELSRIED"]
[null,"ABENSBERG","HOLZHARLANDEN",273111,6037,"",null,"ADELZHAUSEN"]
[null,"ABENSBERG","OFFENSTETTEN",273111,6073,"",null,"ADLKOFEN"]
[null,"ABENSBERG","PULLACH",273111,6080,"",null,"AFFING"]
[null,"ABENSBERG","SANDHARLANDEN",273111,6089,"",null,"AHAM"]
[null,"ABSBERG","KALBENSTEINBERG",577111,3621,"",null,"AHOLFING"]
[null,"ABSBERG","ABSBERG",577111,3622,"",null,"AHOLMING"]
[null,"ABTSWIND","ABTSWIND",675111,1156,"",null,"AHORN"]
[null,"ACHSLACH","ACHSLACH",276111,5735,"",null,"AHORNBERGER FORST"]
[null,"ADELSCHLAG","PIETENFELD",176111,4055,"",null,"AHORNTAL"]
[null,"ADELSCHLAG","ADELSCHLAG",176111,4056,"",null,"AICHA VORM WALD"]
[null,"ADELSCHLAG","OCHSENFELD",176111,4057,"",null,"AICHACH"]
[null,"ADELSCHLAG","MÖCKENLOHE",176111,4058,"",null,"AICHEN"]
[null,"ADELSDORF","ADELSDORF",572111,2751,"",null,"AIDENBACH"]
[null,"ADELSDORF","AISCH",572111,2753,"",null,"AIDHAUSEN"]
[null,"ADELSDORF","HEPPSTÄDT",572111,2793,"",null,"AIGLSBACH"]
[null,"ADELSDORF","NEUHAUS",572111,2820,"",null,"AINDLING"]
[null,"ADELSDORF","UTTSTADT",572111,2840,"",null,"AINRING"]
[null,"ADELSDORF","WEPPERSDORF",572111,2848,"",null,"AISLINGEN"]
[null,"ADELSDORF","WIESENDORF",572111,2849,"",null,"AITERHOFEN"]
[null,"ADELSHOFEN (LKR. AN)","ADELSHOFEN",571111,2902,"",null,"AITRANG"]
[null,"ADELSHOFEN (LKR. AN)","GROßHARBACH",571111,2959,"",null,"ALBACHING"]
[null,"ADELSHOFEN (LKR. AN)","NEUSTETT",571111,3003,"",null,"ALBERTSHOFEN"]
[null,"ADELSHOFEN (LKR. AN)","TAUBERSCHECKENBACH",571111,3042,"",null,"ALDERSBACH"]
[null,"ADELSHOFEN (LKR. AN)","TAUBERZELL",571111,3043,"",null,"ALERHEIM"]
[null,"ADELSHOFEN (LKR. FFB)","ADELSHOFEN",179111,8475,"",null,"ALESHEIM"]
[null,"ADELSHOFEN_(LKR.FFB)","LUTTENWANG",179111,8476,"",null,"ALETSHAUSEN"]
[null,"ADELSRIED","ADELSRIED",772111,7225,"",null,"ALFELD"]
[null,"ADELZHAUSEN","HERETSHAUSEN",771111,7360,"",null,"ALLERSBERG"]
[null,"ADELZHAUSEN","ADELZHAUSEN",771111,7361,"",null,"ALLERSHAUSEN"]
[null,"ADELZHAUSEN","BURGADELZHAUSEN",771111,7362,"",null,"ALLING"]
[null,"ADLKOFEN","WOLFSBACH",274111,6605,"",null,"ALLMANNSHOFEN"]
[null,"ADLKOFEN","OBERAICHBACH",274111,6606,"",null,"ALTDORF"]
[null,"ADLKOFEN","FRAUENBERG",274111,6621,"",null,"ALTDORF B.NÜRNBERG"]
[null,"ADLKOFEN","DEUTENKOFEN",274111,6622,"",null,"ALTEGLOFSHEIM"]
[null,"ADLKOFEN","JENKOFEN",274111,6623,"",null,"ALTENBUCH"]
[null,"ADLKOFEN","ADLKOFEN",274111,6624,"",null,"ALTENBUCHER FORST"]
[null,"ADLKOFEN","DIETELSKIRCHEN",274111,6625,"",null,"ALTENDORF"]
[null,"ADLKOFEN","KRÖNING",274111,6626,"",null,"ALTENKUNSTADT"]
[null,"AFFING","ANWALTING",771112,7444,"",null,"ALTENMARKT A.D.ALZ"]
[null,"AFFING","GEBENHOFEN",771112,7445,"",null,"ALTENMÜNSTER"]
[null,"AFFING","AFFING",771112,7446,"",null,"ALTENSTADT"]
[null,"AFFING","HAUNSWIES",771112,7447,"",null,"ALTENSTADT A.D.WALDN"]
[null,"AFFING","MÜHLHAUSEN",771112,7448,"",null,"ALTENSTÄDTER WALD"]
[null,"AFFING","AULZHAUSEN",771112,7449,"",null,"ALTENTHANN"]
[null,"AHAM","AHAM",274112,6630,"",null,"ALTERTHEIM"]
[null,"AHAM","LOIZENKIRCHEN",274112,6631,"",null,"ALTFRAUNHOFEN"]
[null,"AHAM","NEUHAUSEN",274112,6632,"",null,"ALTHEGNENBERG"]
[null,"AHOLFING","AHOLFING",278112,5603,"",null,"ALTMANNSTEIN"]
[null,"AHOLFING","OBERMOTZING",278112,5604,"",null,"ALTOMÜNSTER"]
[null,"AHOLFING","NIEDERMOTZING",278112,5611,"",null,"ALTÖTTING"]
[null,"AHOLMING","AHOLMING",271111,5935,"",null,"ALTUSRIED"]
[null,"AHORN","AHORN",473112,1302,"",null,"ALZENAU I.UFR."]
[null,"AHORN","HOHENSTEINER FORST",473112,1378,"",null,"AMBERG"]
[null,"AHORN","SCHAFHOF",473112,1468,{"$f":"+IF(A66<>\"\",1,\"\")","v":""},null,"AMERANG"]
[null,"AHORN","SCHORKENDORF",473112,1475,"",null,"AMERDINGEN"]
[null,"AHORN","WITZMANNSBERG",473112,1528,"",null,"AMMERNDORF"]
[null,"AHORN","WOHLBACH",473112,1530,"",null,"AMMERSEE"]
[null,"AHORNBERGER FORST","AHORNBERG",377451,4214,"",null,"AMMERTHAL"]
[null,"AHORNTAL","LANGWEILER WALD",472111,2482,"",null,"AMORBACH"]
[null,"AHORNTAL","VOLSBACH",472111,2514,"",null,"AMPFING"]
[null,"AHORNTAL","KÖRZENDORF",472111,2515,"",null,"ANDECHS"]
[null,"AHORNTAL","REIZENDORF",472111,2516,"",null,"ANGER"]
[null,"AHORNTAL","POPPENDORFER WALD",472111,2517,"",null,"ANNATHALER WALD"]
[null,"AHORNTAL","FREIAHORN",472111,2518,"",null,"ANSBACH"]
[null,"AHORNTAL","KIRCHAHORN",472111,2519,"",null,"ANTDORF"]
[null,"AHORNTAL","CHRISTANZ",472111,2520,"",null,"ANZING"]
[null,"AHORNTAL","POPPENDORF",472111,2521,"",null,"ANZINGER FORST"]
[null,"AHORNTAL","ADLITZ",472111,2522,"",null,"APFELDORF"]
[null,"AHORNTAL","OBERAILSFELD",472111,2523,"",null,"APFELTRACH"]
[null,"AICHA VORM WALD","AICHA VORM WALD",275111,6252,"",null,"ARBERG"]
[null,"AICHA VORM WALD","RATHSMANNSDORF",275111,6257,"",null,"ARESING"]
[null,"AICHACH","WALCHSHOFEN",771113,7450,"",null,"ARNBRUCK"]
[null,"AICHACH","OBERBERNBACH",771113,7451,"",null,"ARNSCHWANG"]
[null,"AICHACH","UNTERWITTELSBACH",771113,7452,"",null,"ARNSTEIN"]
[null,"AICHACH","OBERWITTELSBACH",771113,7453,"",null,"ARNSTORF"]
[null,"AICHACH","OBERSCHNEITBACH",771113,7454,"",null,"ARRACH"]
[null,"AICHACH","ALGERTSHAUSEN",771113,7455,"",null,"ARZBERG"]
[null,"AICHACH","AICHACH",771113,7456,"",null,"ASBACH-BÄUMENHEIM"]
[null,"AICHACH","UNTERGRIESBACH",771113,7457,"",null,"ASCHA"]
[null,"AICHACH","EDENRIED",771113,7458,"",null,"ASCHAFFENBURG"]
[null,"AICHACH","GRIESBECKERZELL",771113,7459,"",null,"ASCHAU A.INN"]
[null,"AICHACH","SULZBACH",771113,7460,"",null,"ASCHAU I.CHIEMGAU"]
[null,"AICHACH","UNTERSCHNEITBACH",771113,7461,"",null,"ASCHHEIM"]
[null,"AICHACH","ECKNACH",771113,7462,"",null,"AßLING"]
[null,"AICHACH","GALLENBACH",771113,7463,"",null,"ATTENHOFEN"]
[null,"AICHACH","KLINGEN",771113,7464,"",null,"ATTENKIRCHEN"]
[null,"AICHACH","OBERMAUERBACH",771113,7465,"",null,"ATTING"]
[null,"AICHEN","MEMMENHAUSEN",774166,7741,"",null,"AU I.D.HALLERTAU"]
[null,"AICHEN","AICHEN",774166,7742,"",null,"AUB"]
[null,"AICHEN","OBERGESSERTSHAUSEN",774166,7743,"",null,"AUBSTADT"]
[null,"AIDENBACH","ALDERSBACH",275112,6268,"",null,"AUERBACH"]
[null,"AIDENBACH","HAIDENBURG",275112,6269,"",null,"AUERBACH I.D.OPF."]
[null,"AIDENBACH","AIDENBACH",275112,6270,"",null,"AUFHAUSEN"]
[null,"AIDHAUSEN","NASSACH",674111,810,"",null,"AUFSEß"]
[null,"AIDHAUSEN","AIDHAUSEN",674111,818,"",null,"AUGSBURG"]
[null,"AIDHAUSEN","HAPPERTSHAUSEN",674111,819,"",null,"AUHAUSEN"]
[null,"AIDHAUSEN","FRIESENHAUSEN",674111,820,"",null,"AURA A.D.SAALE"]
[null,"AIDHAUSEN","KERBFELD",674111,835,"",null,"AURA I.SINNGRUND"]
[null,"AIGLSBACH","AIGLSBACH",273113,6004,"",null,"AURACH"]
[null,"AIGLSBACH","BERGHAUSEN",273113,6014,"",null,"AURACHTAL"]
[null,"AIGLSBACH","GASSELTSHAUSEN",273113,6023,"",null,"AUßERNZELL"]
[null,"AIGLSBACH","OBERPINDHART",273113,6069,"",null,"AUWALD"]
[null,"AIGLSBACH","PÖBENHAUSEN",273113,6077,"",null,"AYING"]
[null,"AINDLING","PICHL",771114,7414,"",null,"AYSTETTEN"]
[null,"AINDLING","AINDLING",771114,7418,"",null,"BAAR"]
[null,"AINDLING","BINNENBACH",771114,7419,"",null,"BAAR-EBENHAUSEN"]
[null,"AINDLING","HAUSEN",771114,7423,"",null,"BABENHAUSEN"]
[null,"AINDLING","STOTZARD",771114,7424,"",null,"BABENSHAM"]
[null,"AINDLING","GAULZHOFEN",771114,7425,"",null,"BACH A.D.DONAU"]
[null,"AINRING","STRAß",172111,9935,"",null,"BACHHAGEL"]
[null,"AINRING","AINRING",172111,9936,"",null,"BÄCHINGEN A.D.BRENZ"]
[null,"AISLINGEN","AISLINGEN",773111,6892,"",null,"BAD ABBACH"]
[null,"AISLINGEN","BAUMGARTEN",773111,6893,"",null,"BAD AIBLING"]
[null,"AITERHOFEN","AMSELFING",278113,5627,"",null,"BAD ALEXANDERSBAD"]
[null,"AITERHOFEN","GELTOLFING",278113,5639,"",null,"BAD BERNECK I.FICHTE"]
[null,"AITERHOFEN","AITERHOFEN",278113,5640,"",null,"BAD BIRNBACH"]
[null,"AITERHOFEN","NIEDERHARTHAUSEN",278113,5645,"",null,"BAD BOCKLET"]
[null,"AITRANG","HUTTENWANG",777111,7870,{"$f":"+IF(A130<>\"\",1,\"\")","v":""},null,"BAD BRÜCKENAU"]
[null,"AITRANG","AITRANG",777111,7871,"",null,"BAD ENDORF"]
[null,"AITRANG","APFELTRANG",777111,7872,"",null,"BAD FEILNBACH"]
[null,"AITRANG","WENGLINGEN",777111,7921,"",null,"BAD FÜSSING"]
[null,"ALBACHING","ALBACHING",187186,9737,"",null,"BAD GRIESBACH I.ROTT"]
[null,"ALBACHING","UTZENBICHL",187186,9739,"",null,"BAD GRÖNENBACH"]
[null,"ALBERTSHOFEN","ALBERTSHOFEN",675112,1150,"",null,"BAD HEILBRUNN"]
[null,"ALDERSBACH","WALCHSING",275114,6266,"",null,"BAD KISSINGEN"]
[null,"ALDERSBACH","PÖRNDORF",275114,6267,"",null,"BAD KOHLGRUB"]
[null,"ALDERSBACH","ALDERSBACH",275114,6268,"",null,"BAD KÖNIGSHOFEN I.GR"]
[null,"ALDERSBACH","HAIDENBURG",275114,6269,"",null,"BAD NESSELWANG"]
[null,"ALERHEIM","ALERHEIM",779111,6748,"",null,"BAD NEUSTADT A.D.SAA"]
[null,"ALERHEIM","RUDELSTETTEN",779111,6749,"",null,"BAD REICHENHALL"]
[null,"ALERHEIM","WÖRNITZOSTHEIM",779111,6750,"",null,"BAD RODACH"]
[null,"ALERHEIM","BÜHL I.RIES",779111,6751,"",null,"BAD STEBEN"]
[null,"ALESHEIM","WACHENHOFEN",577113,3635,"",null,"BAD TÖLZ"]
[null,"ALESHEIM","ALESHEIM",577113,3636,"",null,"BAD WIESSEE"]
[null,"ALESHEIM","TROMMETSHEIM",577113,3637,"",null,"BAD WINDSHEIM"]
[null,"ALETSHAUSEN","ALETSHAUSEN",774111,7714,"",null,"BAD WÖRISHOFEN"]
[null,"ALETSHAUSEN","WINZER",774111,7715,"",null,"BAIERBACH"]
[null,"ALETSHAUSEN","HAUPELTSHOFEN",774111,7716,"",null,"BAIERBRUNN"]
[null,"ALFELD","ALFELD",574111,3502,"",null,"BAIERN"]
[null,"ALFELD","POLLANDEN",574111,3560,"",null,"BAIERSDORF"]
[null,"ALLERSBERG","ALLERSBERG",576113,3805,"",null,"BAISWEIL"]
[null,"ALLERSBERG","ALTENFELDEN",576113,3806,"",null,"BALDERSCHWANG"]
[null,"ALLERSBERG","BIRKACH",576113,3813,"",null,"BALZHAUSEN"]
[null,"ALLERSBERG","BRUNNAU",576113,3814,"",null,"BAMBERG"]
[null,"ALLERSBERG","EBENRIED",576113,3818,"",null,"BARBING"]
[null,"ALLERSBERG","GÖGGELSBUCH",576113,3828,"",null,"BÄRNAU"]
[null,"ALLERSBERG","LAMPERSDORF",576113,3856,"",null,"BÄRNHOF"]
[null,"ALLERSHAUSEN","SCHLIPPS",178113,8301,"",null,"BASTHEIM"]
[null,"ALLERSHAUSEN","ALLERSHAUSEN",178113,8302,"",null,"BAUDENBACH"]
[null,"ALLERSHAUSEN","AITERBACH",178113,8303,"",null,"BAUNACH"]
[null,"ALLERSHAUSEN","TÜNZHAUSEN",178113,8304,"",null,"BAYERBACH"]
[null,"ALLING","ALLING",179113,8497,"",null,"BAYERBACH-ERGOLDSBAC"]
[null,"ALLING","BIBURG",179113,8498,"",null,"BAYERISCH EISENSTEIN"]
[null,"ALLING","HOLZHAUSEN",179113,8499,"",null,"BAYERISCH GMAIN"]
[null,"ALLMANNSHOFEN","ALLMANNSHOFEN",772114,6983,"",null,"BAYERSOIEN"]
[null,"ALTDORF","PFETTRACH",274113,6613,"",null,"BAYREUTH"]
[null,"ALTDORF","EUGENBACH",274113,6614,"",null,"BAYRISCHZELL"]
[null,"ALTDORF","ALTDORF",274113,6615,"",null,"BECHHOFEN"]
[null,"ALTDORF B.NÜRNBERG","ALTDORF B.NÜRNBERG",574112,3402,"",null,"BECHTSRIETH"]
[null,"ALTDORF B.NÜRNBERG","EISMANNSBERG",574112,3413,"",null,"BEHRINGERSDORFER FORST"]
[null,"ALTDORF B.NÜRNBERG","GRÜNSBERG",574112,3430,"",null,"BEILNGRIES"]
[null,"ALTDORF B.NÜRNBERG","HAGENHAUSEN",574112,3431,"",null,"BELLENBERG"]
[null,"ALTDORF B.NÜRNBERG","PENZENHOFEN",574112,3453,"",null,"BENEDIKTBEUERN"]
[null,"ALTDORF B.NÜRNBERG","PÜHLHEIM",574112,3455,"",null,"BENNINGEN"]
[null,"ALTDORF B.NÜRNBERG","RASCH",574112,3456,"",null,"BERATZHAUSEN"]
[null,"ALTDORF B.NÜRNBERG","RIEDEN",574112,3459,"",null,"BERCHING"]
[null,"ALTDORF B.NÜRNBERG","RÖTHENBACH B.ALTDORF",574112,3460,"",null,"BERCHTESGADEN"]
[null,"ALTEGLOFSHEIM","ALTEGLOFSHEIM",375113,5203,"",null,"BERG"]
[null,"ALTENBUCH","ALTENBUCHER FORST",676111,426,"",null,"BERG B.NEUMARKT I.D."]
[null,"ALTENBUCH","OBERALTENBUCH",676111,429,"",null,"BERG I.GAU"]
[null,"ALTENBUCH","UNTERALTENBUCH",676111,430,"",null,"BERGEN"]
[null,"ALTENBUCHER FORST","ALTENBUCHER FORST",676451,426,"",null,"BERGHEIM"]
[null,"ALTENDORF (LKR. BA)","ALTENDORF",471111,2103,"",null,"BERGKIRCHEN"]
[null,"ALTENDORF (LKR. BA)","SEUßLING",471111,2287,"",null,"BERGLERN"]
[null,"ALTENDORF (LKR. SAD)","WILLHOF",376112,4868,"",null,"BERGRHEINFELD"]
[null,"ALTENDORF (LKR. SAD)","DÜRNERSDORF",376112,4869,"",null,"BERGTHEIM"]
[null,"ALTENDORF (LKR. SAD)","ALTENDORF",376112,4870,"",null,"BERNAU A.CHIEMSEE"]
[null,"ALTENDORF (LKR. SAD)","FRONHOF",376112,4871,"",null,"BERNBEUREN"]
[null,"ALTENKUNSTADT","ZEUBLITZ",478111,1816,"",null,"BERNGAU"]
[null,"ALTENKUNSTADT","STRÖSSENDORF",478111,1817,"",null,"BERNHARDSWALD"]
[null,"ALTENKUNSTADT","BURKHEIM",478111,1818,"",null,"BERNRIED"]
[null,"ALTENKUNSTADT","PFAFFENDORF",478111,1819,{"$f":"+IF(A194<>\"\",1,\"\")","v":""},null,"BESSENBACH"]
[null,"ALTENKUNSTADT","ALTENKUNSTADT",478111,1820,"",null,"BETZENSTEIN"]
[null,"ALTENKUNSTADT","MAINECK",478111,1821,"",null,"BETZIGAU"]
[null,"ALTENKUNSTADT","MAINECKER FORST",478111,1822,"",null,"BEUTELSBACH"]
[null,"ALTENMARKT A.D.ALZ","RABENDEN",189111,9815,"",null,"BIBERBACH"]
[null,"ALTENMARKT A.D.ALZ","ALTENMARKT A.D.ALZ",189111,9816,"",null,"BIBERTAL"]
[null,"ALTENMÜNSTER","ALTENMÜNSTER",772115,7211,"",null,"BIBURG"]
[null,"ALTENMÜNSTER","BAIERSHOFEN",772115,7212,"",null,"BICHL"]
[null,"ALTENMÜNSTER","HENNHOFEN",772115,7213,"",null,"BIDINGEN"]
[null,"ALTENMÜNSTER","HEGNENBACH",772115,7214,"",null,"BIEBELRIED"]
[null,"ALTENMÜNSTER","ZUSAMZELL",772115,7215,"",null,"BIEBEREHREN"]
[null,"ALTENMÜNSTER","EPPISHOFEN",772115,7216,"",null,"BIESSENHOFEN"]
[null,"ALTENMÜNSTER","NEUMÜNSTER",772115,7217,"",null,"BINDLACH"]
[null,"ALTENMÜNSTER","UNTERSCHÖNEBERG",772115,7218,"",null,"BINSWANGEN"]
[null,"ALTENSTADT (LKR. NU)","HERRENSTETTEN",775111,7523,"",null,"BIRGLAND"]
[null,"ALTENSTADT (LKR. NU)","UNTEREICHEN",775111,7524,"",null,"BIRKACH"]
[null,"ALTENSTADT (LKR. NU)","ALTENSTADT",775111,7525,"",null,"BIRKENFELD"]
[null,"ALTENSTADT (LKR. NU)","KELLMÜNZ A.D.ILLER",775111,7526,"",null,"BIRNBAUM"]
[null,"ALTENSTADT (LKR. NU)","GRAFENWALD",775111,7529,"",null,"BISCHBERG"]
[null,"ALTENSTADT (LKR. NU)","FILZINGEN",775111,7609,"",null,"BISCHBRUNN"]
[null,"ALTENSTADT (LKR. WM)","ALTENSTADT",190111,9081,"",null,"BISCHBRUNNER FORST"]
[null,"ALTENSTADT (LKR. WM)","SCHWABNIEDERHOFEN",190111,9099,"",null,"BISCHOFSGRÜN"]
[null,"ALTENSTADT A.D.WALDN","MEERBODENREUTH",374111,4353,"",null,"BISCHOFSGRÜNER FORST"]
[null,"ALTENSTADT A.D.WALDN","ALTENSTADT A.D.WALDNAAB",374111,4354,"",null,"BISCHOFSHEIM A.D.RHÖ"]
[null,"ALTENSTÄDTER WALD","PARKSTEIN",374445,4309,"",null,"BISCHOFSMAIS"]
[null,"ALTENSTÄDTER WALD","MEERBODENREUTH",374445,4353,"",null,"BISCHOFSWIESEN"]
[null,"ALTENTHANN","ALTENTHANN",375114,5204,"",null,"BISCHOFSWIESENER FORST"]
[null,"ALTENTHANN","DIETERSWEG",375114,5222,"",null,"BISSINGEN"]
[null,"ALTENTHANN","FORSTMÜHLER FORST",375114,5231,"",null,"BLAIBACH"]
[null,"ALTENTHANN","GÖPPENBACH",375114,5241,"",null,"BLAICHACH"]
[null,"ALTENTHANN","LICHTENWALD",375114,5280,"",null,"BLANKENBACH"]
[null,"ALTENTHANN","PFAFFENFANG",375114,5301,"",null,"BLINDHEIM"]
[null,"ALTERTHEIM","UNTERALTERTHEIM",679165,712,"",null,"BÖBING"]
[null,"ALTERTHEIM","OBERALTERTHEIM",679165,713,"",null,"BOBINGEN"]
[null,"ALTERTHEIM","STEINBACH",679165,718,"",null,"BÖBRACH"]
[null,"ALTFRAUNHOFEN","ALTFRAUNHOFEN",274114,6652,"",null,"BOCKHORN"]
[null,"ALTHEGNENBERG","ALTHEGNENBERG",179114,8470,"",null,"BODENKIRCHEN"]
[null,"ALTHEGNENBERG","HÖRBACH",179114,8471,"",null,"BODENMAIS"]
[null,"ALTMANNSTEIN","WINDEN",176112,8001,"",null,"BODENWÖHR"]
[null,"ALTMANNSTEIN","PONDORF",176112,8002,"",null,"BODENWÖHRER FORST"]
[null,"ALTMANNSTEIN","THANNHAUSEN",176112,8003,"",null,"BODOLZ"]
[null,"ALTMANNSTEIN","BREITENHILL",176112,8004,"",null,"BOGEN"]
[null,"ALTMANNSTEIN","MEGMANNSDORF",176112,8005,"",null,"BÖHEN"]
[null,"ALTMANNSTEIN","SCHAMHAUPTEN",176112,8006,"",null,"BÖHMFELD"]
[null,"ALTMANNSTEIN","SCHAFSHILL",176112,8007,"",null,"BOLSTERLANG"]
[null,"ALTMANNSTEIN","HEXENAGGER",176112,8008,"",null,"BONSTETTEN"]
[null,"ALTMANNSTEIN","STEINSDORF",176112,8009,"",null,"BOOS"]
[null,"ALTMANNSTEIN","SANDERSDORF",176112,8010,"",null,"BRAND"]
[null,"ALTMANNSTEIN","NEUENHINZENHAUSEN",176112,8011,"",null,"BRANNENBURG"]
[null,"ALTMANNSTEIN","BERGHAUSEN",176112,8012,"",null,"BREITBRUNN"]
[null,"ALTMANNSTEIN","TETTENWANG",176112,8013,"",null,"BREITBRUNN A.CHIEMSE"]
[null,"ALTMANNSTEIN","ALTMANNSTEIN",176112,8014,"",null,"BREITENBERG"]
[null,"ALTMANNSTEIN","MENDORF",176112,8015,"",null,"BREITENBRUNN"]
[null,"ALTMANNSTEIN","HAGENHILL",176112,8016,"",null,"BREITENGÜßBACH"]
[null,"ALTMANNSTEIN","LAIMERSTADT",176112,8017,"",null,"BREITENGÜßBACHER FORST"]
[null,"ALTMANNSTEIN","SCHWABSTETTEN",176112,8018,"",null,"BREITENTHAL"]
[null,"ALTOMÜNSTER","ALTOMÜNSTER",174111,8556,"",null,"BRENNBERG"]
[null,"ALTOMÜNSTER","HOHENZELL",174111,8558,"",null,"BRUCK"]
[null,"ALTOMÜNSTER","KIEMERTSHOFEN",174111,8559,"",null,"BRUCK I.D.OPF."]
[null,"ALTOMÜNSTER","OBERZEITLBACH",174111,8562,"",null,"BRUCKBERG"]
[null,"ALTOMÜNSTER","RANDELSRIED",174111,8563,"",null,"BRUCKMÜHL"]
[null,"ALTOMÜNSTER","STUMPFENBACH",174111,8564,"",null,"BRUNN"]
[null,"ALTOMÜNSTER","THALHAUSEN",174111,8566,"",null,"BRUNNEN"]
[null,"ALTOMÜNSTER","WOLLOMOOS",174111,8567,"",null,"BRUNNTHAL"]
[null,"ALTOMÜNSTER","PIPINSRIED",174111,8638,{"$f":"+IF(A258<>\"\",1,\"\")","v":""},null,"BUBENREUTH"]
[null,"ALTÖTTING","ALTÖTTING",171111,8901,"",null,"BUBESHEIM"]
[null,"ALTÖTTING","FORSTKASTL",171111,8912,"",null,"BUCH"]
[null,"ALTÖTTING","OBERKASTL",171111,8926,"",null,"BUCH A.BUCHRAIN"]
[null,"ALTÖTTING","RAITENHART",171111,8931,"",null,"BUCH A.ERLBACH"]
[null,"ALTÖTTING","ALTÖTTINGER FORST",171111,8946,"",null,"BUCH A.WALD"]
[null,"ALTUSRIED","FRAUENZELL",780112,7651,"",null,"BUCHBACH"]
[null,"ALTUSRIED","MUTHMANNSHOFEN",780112,7652,"",null,"BUCHBRUNN"]
[null,"ALTUSRIED","HOHENTANNER WALD",780112,7653,"",null,"BUCHDORF"]
[null,"ALTUSRIED","KIMRATSHOFEN",780112,7654,"",null,"BÜCHENBACH"]
[null,"ALTUSRIED","ALTUSRIED",780112,7655,"",null,"BUCHENBERG"]
[null,"ALTUSRIED","KRUGZELL",780112,7656,"",null,"BUCHHOFEN"]
[null,"ALZENAU I.UFR.","ALBSTADT",671111,302,"",null,"BÜCHLBERG"]
[null,"ALZENAU I.UFR.","ALZENAU I.UFR.",671111,306,"",null,"BUCHLOE"]
[null,"ALZENAU I.UFR.","KÄLBERAU",671111,307,"",null,"BUCKENHOF"]
[null,"ALZENAU I.UFR.","MICHELBACH",671111,308,"",null,"BUCKENHOFER FORST"]
[null,"ALZENAU I.UFR.","WASSERLOS",671111,322,"",null,"BUNDORF"]
[null,"ALZENAU I.UFR.","HÖRSTEIN",671111,333,"",null,"BUNDORFER FORST"]
[null,"ALZENAU I.UFR.","ALZENAU, BERGWERKE",671111,395,"",null,"BURGAU"]
[null,"ALZENAU I.UFR.","Alzenau, Fischereirechte",671111,396,"",null,"BURGBERG I.ALLGÄU"]
[null,"AMBERG (LKR. AM)","KARMENSÖLDEN",361000,4514,"",null,"BURGBERNHEIM"]
[null,"AMBERG (LKR. AM)","TRAßLBERG",361000,4515,"",null,"BURGEBRACH"]
[null,"AMBERG (LKR. AM)","AMMERSRICHT",361000,4516,"",null,"BÜRGERWALD"]
[null,"AMBERG (LKR. AM)","AMBERG",361000,4517,"",null,"BURGGEN"]
[null,"AMBERG (LKR. AM)","RAIGERING",361000,4518,"",null,"BURGHASLACH"]
[null,"AMBERG (LKR. AM)","GAILOH",361000,4535,"",null,"BURGHAUSEN"]
[null,"AMBERG (LKR. AM)","GÄRMERSDORF",361000,4539,"",null,"BURGHEIM"]
[null,"AMBERG (LKR. AM)","AMBERG, BERGWERKE",361000,4571,"",null,"BURGJOß"]
[null,"AMBERG (LKR. MN)","AMBERG",778111,7789,"",null,"BURGKIRCHEN A.D.ALZ"]
[null,"AMERANG","AMERANG",187113,9786,"",null,"BURGKUNSTADT"]
[null,"AMERANG","EVENHAUSEN",187113,9787,"",null,"BURGLAUER"]
[null,"AMERANG","KIRCHENSUR",187113,9788,"",null,"BURGLENGENFELD"]
[null,"AMERANG","UNTERRATTING",187113,9789,"",null,"BURGOBERBACH"]
[null,"AMERDINGEN","BOLLSTADT",779112,6765,"",null,"BURGPREPPACH"]
[null,"AMERDINGEN","AMERDINGEN",779112,6766,"",null,"BURGSALACH"]
[null,"AMMERNDORF","AMMERNDORF",573111,3357,"",null,"BURGSINN"]
[null,"AMMERSEE","DIEßEN A.AMMERSEE",181451,9009,"",null,"BÜRGSTADT"]
[null,"AMMERTHAL","AMMERTHAL",371111,4512,"",null,"BURGTHANN"]
[null,"AMMERTHAL","GÖTZENDORF",371111,4530,"",null,"BURGWALLBACHER FORST"]
[null,"AMORBACH","WEILBACH",676112,463,"",null,"BURGWINDHEIM"]
[null,"AMORBACH","BOXBRUNN I.ODENWALD",676112,467,"",null,"BURK"]
[null,"AMORBACH","AMORBACH",676112,468,"",null,"BURKARDROTH"]
[null,"AMORBACH","REICHARTSHAUSEN",676112,470,"",null,"BURTENBACH"]
[null,"AMORBACH","OTTERBACH",676112,473,"",null,"BUTTENHEIM"]
[null,"AMORBACH","BEUCHEN",676112,478,"",null,"BUTTENWIESEN"]
[null,"AMPFING","STEFANSKIRCHEN",183112,8831,"",null,"BÜTTHARD"]
[null,"AMPFING","SALMANSKIRCHEN",183112,8832,"",null,"BUXHEIM"]
[null,"AMPFING","AMPFING",183112,8840,"",null,"CADOLZBURG"]
[null,"ANDECHS","FRIEDING",188117,9178,"",null,"CALLENBERGER FORST-WEST"]
[null,"ANDECHS","ERLING-ANDECHS",188117,9183,"",null,"CASTELL"]
[null,"ANDECHS","MACHTLFING",188117,9192,"",null,"CHAM"]
[null,"ANGER","STAUFENECKER FORST",172112,9937,"",null,"CHAMERAU"]
[null,"ANGER","ANGER",172112,9938,"",null,"CHIEMING"]
[null,"ANGER","AUFHAM",172112,9939,"",null,"CHIEMSEE"]
[null,"ANGER","HÖGL",172112,9940,"",null,"COBURG"]
[null,"ANNATHALER WALD","ANNATHAL",272451,5810,"",null,"COLLENBERG"]
[null,"ANSBACH","ANSBACH",561000,3105,"",null,"COLMBERG"]
[null,"ANSBACH","BERNHARDSWINDEN",561000,3111,"",null,"CREUßEN"]
[null,"ANSBACH","BRODSWINDEN",561000,3118,"",null,"CREUßENER HAGENREUTH"]
[null,"ANSBACH","CLAFFHEIM",561000,3126,"",null,"DACHAU"]
[null,"ANSBACH","ELPERSDORF B.ANSBACH",561000,3133,"",null,"DACHSBACH"]
[null,"ANSBACH","EYB",561000,3137,"",null,"DAITING"]
[null,"ANSBACH","HENNENBACH",561000,3155,"",null,"DAMMBACH"]
[null,"ANSBACH","NEUSES B.ANSBACH",561000,3197,"",null,"DASCHENDORFER FORST"]
[null,"ANSBACH","SCHALKHAUSEN",561000,3216,{"$f":"+IF(A322<>\"\",1,\"\")","v":""},null,"DASING"]
[null,"ANTDORF","FRAUENRAIN",190113,9227,"",null,"DECHENWALD"]
[null,"ANTDORF","ANTDORF",190113,9228,"",null,"DEGGENDORF"]
[null,"ANZING","ANZING",175111,8751,"",null,"DEINING"]
[null,"ANZING","ANZINGER FORST",175111,8782,"",null,"DEININGEN"]
[null,"ANZINGER FORST","ANZINGER FORST",175451,8782,"",null,"DEISENHAUSEN"]
[null,"APFELDORF","APFELDORF",181111,9001,"",null,"DEISENHOFENER FORST"]
[null,"APFELTRACH","APFELTRACH",778113,7794,"",null,"DENKENDORF"]
[null,"APFELTRACH","SAULENGRAIN",778113,7795,"",null,"DENKLINGEN"]
[null,"APFELTRACH","KÖNGETRIED",778113,7796,"",null,"DENTLEIN A.FORST"]
[null,"ARBERG","ARBERG",571113,3106,"",null,"DETTELBACH"]
[null,"ARBERG","GROßLELLENFELD",571113,3150,"",null,"DEUERLING"]
[null,"ARBERG","KEMMATHEN",571113,3170,"",null,"DIEBACH"]
[null,"ARBERG","KLEINLELLENFELD",571113,3174,"",null,"DIEDORF"]
[null,"ARBERG","MÖRSACH",571113,3189,"",null,"DIESPECK"]
[null,"ARESING","RETTENBACH",185113,8113,"",null,"DIEßEN A.AMMERSEE"]
[null,"ARESING","ARESING",185113,8114,"",null,"DIETENHOFEN"]
[null,"ARESING","OBERLAUTERBACH",185113,8115,"",null,"DIETERSBURG"]
[null,"ARESING","UNTERWEILENBACH",185113,8116,"",null,"DIETERSHEIM"]
[null,"ARNBRUCK","NIEDERNDORF",276113,5702,"",null,"DIETERSKIRCHEN"]
[null,"ARNBRUCK","ARNBRUCK",276113,5703,"",null,"DIETFURT A.D.ALTMÜHL"]
[null,"ARNSCHWANG","ARNSCHWANG",372112,5052,"",null,"DIETMANNSRIED"]
[null,"ARNSCHWANG","NÖßWARTLING",372112,5053,"",null,"DIETRAMSZELL"]
[null,"ARNSCHWANG","ZENCHING",372112,5054,"",null,"DILLINGEN A.D.DONAU"]
[null,"ARNSTEIN","NEUBESSINGEN",677114,884,"",null,"DINGOLFING"]
[null,"ARNSTEIN","ALTBESSINGEN",677114,908,"",null,"DINGOLSHAUSEN"]
[null,"ARNSTEIN","SCHWEBENRIED",677114,909,"",null,"DINKELSBÜHL"]
[null,"ARNSTEIN","BÜCHOLD",677114,926,"",null,"DINKELSCHERBEN"]
[null,"ARNSTEIN","HEUGRUMBACH",677114,949,"",null,"DIRLEWANG"]
[null,"ARNSTEIN","ARNSTEIN",677114,950,"",null,"DITTELBRUNN"]
[null,"ARNSTEIN","HALSHEIM",677114,971,"",null,"DITTENHEIM"]
[null,"ARNSTEIN","MÜDESHEIM",677114,972,"",null,"DÖHLAU"]
[null,"ARNSTEIN","REUCHELHEIM",677114,973,"",null,"DOLLNSTEIN"]
[null,"ARNSTEIN","GÄNHEIM",677114,974,"",null,"DOMBÜHL"]
[null,"ARNSTEIN","BINSFELD",677114,995,"",null,"DONAUSTAUF"]
[null,"ARNSTEIN","BINSBACH",677114,996,"",null,"DONAUWÖRTH"]
[null,"ARNSTORF","ARNSTORF",277111,6402,"",null,"DONNERSDORF"]
[null,"ARNSTORF","HAINBERG",277111,6418,"",null,"DORFEN"]
[null,"ARNSTORF","JÄGERNDORF",277111,6425,"",null,"DÖRFLES-ESBACH"]
[null,"ARNSTORF","KOHLSTORF",277111,6428,"",null,"DORFPROZELTEN"]
[null,"ARNSTORF","MARIAKIRCHEN",277111,6438,"",null,"DORMITZ"]
[null,"ARNSTORF","MITTERHAUSEN",277111,6441,"",null,"DORMITZER FORST"]
[null,"ARNSTORF","RUPPERTSKIRCHEN",277111,6460,"",null,"DORNSTADT-LINKERSBAINDT"]
[null,"ARNSTORF","SATTLERN",277111,6462,"",null,"DRACHSELSRIED"]
[null,"ARNSTORF","UNTERHÖFT",277111,6475,"",null,"DREISTELZER FORST"]
[null,"ARRACH","HAIBÜHL",372113,5113,"",null,"DUGGENDORF"]
[null,"ARRACH","ARRACH",372113,5114,"",null,"DURACH"]
[null,"ARZBERG","KOTHIGENBIBERSBACH",479112,2043,"",null,"DÜRNBUCHER FORST"]
[null,"ARZBERG","ARZBERGER FORST",479112,2045,"",null,"DÜRRLAUINGEN"]
[null,"ARZBERG","GRAFENREUTH",479112,2054,"",null,"DÜRRWANGEN"]
[null,"ARZBERG","BERGNERSREUTH",479112,2072,"",null,"EBELSBACH"]
[null,"ARZBERG","SCHLOTTENHOF",479112,2073,"",null,"EBENSFELD"]
[null,"ARZBERG","OSCHWITZ",479112,2074,"",null,"EBERFING"]
[null,"ARZBERG","RÖTHENBACH",479112,2075,"",null,"EBERMANNSDORF"]
[null,"ARZBERG","ARZBERG",479112,2076,"",null,"EBERMANNSTADT"]
[null,"ARZBERG","SEUßEN",479112,2077,"",null,"EBERN"]
[null,"ARZBERG","HAID",479112,2078,"",null,"EBERSBERG"]
[null,"ASBACH-BÄUMENHEIM","ASBACH-BÄUMENHEIM",779115,6978,"",null,"EBERSBERGER FORST"]
[null,"ASCHA","BÄRNZELL",278116,5579,"",null,"EBERSDORF B.COBURG"]
[null,"ASCHA","ASCHA",278116,5580,"",null,"EBERSHAUSEN"]
[null,"ASCHA","GSCHWENDT",278116,5588,"",null,"EBERSHAUSER-NATTENHAUSER WALD"]
[null,"ASCHAFFENBURG","DAMM",661000,362,"",null,"EBNATH"]
[null,"ASCHAFFENBURG","LEIDER",661000,367,"",null,"EBRACH"]
[null,"ASCHAFFENBURG","ASCHAFFENBURG",661000,368,"",null,"EBRACHER FORST"]
[null,"ASCHAFFENBURG","SCHWEINHEIM",661000,375,{"$f":"+IF(A386<>\"\",1,\"\")","v":""},null,"ECHING"]
[null,"ASCHAFFENBURG","GAILBACH",661000,376,"",null,"ECHING A.AMMERSEE"]
[null,"ASCHAFFENBURG","OBERNAU",661000,383,"",null,"ECK"]
[null,"ASCHAFFENBURG","ASCHAFFENBURG, BERGWERKE",661000,394,"",null,"ECKARTSER HART U.FONDSBERG"]
[null,"ASCHAU A.INN","ASCHAU A.INN",183113,8846,"",null,"ECKENTAL"]
[null,"ASCHAU A.INN","FRAHAM",183113,8847,"",null,"ECKERSDORF"]
[null,"ASCHAU I.CHIEMGAU","HOHENASCHAU I.CHIEMGAU",187114,9639,"",null,"EDELSFELD"]
[null,"ASCHAU I.CHIEMGAU","NIEDERASCHAU I.CHIEMGAU",187114,9653,"",null,"EDERHEIM"]
[null,"ASCHAU I.CHIEMGAU","SACHRANG",187114,9670,"",null,"EDLING"]
[null,"ASCHAU I.CHIEMGAU","UMRATHSHAUSEN",187114,9678,"",null,"EFFELTRICH"]
[null,"ASCHHEIM","ASCHHEIM",184112,8661,"",null,"EGENHOFEN"]
[null,"ASCHHEIM","DORNACH",184112,8667,"",null,"EGG A.D.GÜNZ"]
[null,"AßLING","AßLING",175112,8752,"",null,"EGGENFELDEN"]
[null,"AßLING","LOITERSDORF",175112,8766,"",null,"EGGENTHAL"]
[null,"ATTENHOFEN","ATTENHOFEN",273115,6010,"",null,"EGGLHAM"]
[null,"ATTENHOFEN","OBERWANGENBACH",273115,6072,"",null,"EGGLKOFEN"]
[null,"ATTENHOFEN","PÖTZMES",273115,6078,"",null,"EGGOLSHEIM"]
[null,"ATTENHOFEN","WALKERTSHOFEN",273115,6103,"",null,"EGGSTÄTT"]
[null,"ATTENKIRCHEN","REICHERTSHAUSEN",178115,8264,"",null,"EGING A.SEE"]
[null,"ATTENKIRCHEN","SILLERTSHAUSEN",178115,8283,"",null,"EGLFING"]
[null,"ATTENKIRCHEN","PFETTRACH",178115,8284,"",null,"EGLHARTINGER FORST"]
[null,"ATTENKIRCHEN","ATTENKIRCHEN",178115,8285,"",null,"EGLING"]
[null,"ATTENKIRCHEN","WIMPASING",178115,8286,"",null,"EGLING A.D.PAAR"]
[null,"ATTING","ATTING",278117,5621,"",null,"EGLOFFSTEIN"]
[null,"AU I.D.HALLERTAU","OSTERWAAL",178116,8256,"",null,"EGMATING"]
[null,"AU I.D.HALLERTAU","RUDERTSHAUSEN",178116,8257,"",null,"EGWEIL"]
[null,"AU I.D.HALLERTAU","OSSELTSHAUSEN",178116,8258,"",null,"EHEKIRCHEN"]
[null,"AU I.D.HALLERTAU","GÜNZENHAUSEN",178116,8259,"",null,"EHINGEN"]
[null,"AU I.D.HALLERTAU","AU I.D.HALLERTAU",178116,8260,"",null,"EHINGEN A.RIES"]
[null,"AU I.D.HALLERTAU","HASLACH",178116,8261,"",null,"EIBELSTADT"]
[null,"AU I.D.HALLERTAU","HEMHAUSEN",178116,8262,"",null,"EICHEN"]
[null,"AU I.D.HALLERTAU","HIRNKIRCHEN",178116,8263,"",null,"EICHENAU"]
[null,"AU I.D.HALLERTAU","REICHERTSHAUSEN",178116,8264,"",null,"EICHENBÜHL"]
[null,"AU I.D.HALLERTAU","SILLERTSHAUSEN",178116,8283,"",null,"EICHENDORF"]
[null,"AUB","BALDERSHEIM",679114,769,"",null,"EICHSTÄTT"]
[null,"AUB","AUB",679114,770,"",null,"EICHWALD"]
[null,"AUB","BURGERROTH",679114,773,"",null,"EINSIEDLER/WALDERBACHER FORST"]
[null,"AUBSTADT","AUBSTADT",673113,84,"",null,"EISELFING"]
[null,"AUERBACH","URLADING",271113,5921,"",null,"EISENBERG"]
[null,"AUERBACH","AUERBACH",271113,5944,"",null,"EISENHEIM"]
[null,"AUERBACH","ENGOLLING",271113,5945,"",null,"EISINGEN"]
[null,"AUERBACH I.D.OPF.","KROTTENSEE",371113,3547,"",null,"EITENSHEIM"]
[null,"AUERBACH I.D.OPF.","RANZENTHAL",371113,4274,"",null,"EITTING"]
[null,"AUERBACH I.D.OPF.","GUNZENDORF",371113,4275,"",null,"ELCHINGEN"]
[null,"AUERBACH I.D.OPF.","NASNITZ",371113,4276,"",null,"ELFERSHAUSEN"]
[null,"AUERBACH I.D.OPF.","STEINAMWASSER",371113,4277,"",null,"ELLGAU"]
[null,"AUERBACH I.D.OPF.","DEGELSDORF",371113,4278,"",null,"ELLINGEN"]
[null,"AUERBACH I.D.OPF.","ZOGENREUTH",371113,4279,"",null,"ELLZEE"]
[null,"AUERBACH I.D.OPF.","MICHELFELD",371113,4280,"",null,"ELSENDORF"]
[null,"AUERBACH I.D.OPF.","RANNA",371113,4281,"",null,"ELSENFELD"]
[null,"AUERBACH I.D.OPF.","AUERBACH I.D.OPF.",371113,4282,"",null,"ELTMANN"]
[null,"AUERBACH I.D.OPF.","NITZLBUCH",371113,4283,"",null,"EMERSACKER"]
[null,"AUERBACH I.D.OPF.","EBERSBERG",371113,4284,"",null,"EMMERING"]
[null,"AUFHAUSEN","AUFHAUSEN",375115,5206,"",null,"EMMERTING"]
[null,"AUFHAUSEN","HELLKOFEN",375115,5261,"",null,"EMSKIRCHEN"]
[null,"AUFHAUSEN","NIEDERHINKOFEN",375115,5290,"",null,"EMTMANNSBERG"]
[null,"AUFHAUSEN","PETZKOFEN",375115,5300,"",null,"ENGELSBERG"]
[null,"AUFHAUSEN","TRIFTLFING",375115,5342,"",null,"ENGELTHAL"]
[null,"AUFSEß","SACHSENDORF",472115,2401,"",null,"ENGELTHALER FORST"]
[null,"AUFSEß","NEUHAUS",472115,2402,"",null,"ENSDORF"]
[null,"AUFSEß","AUFSEß",472115,2403,"",null,"EPPENBERG U.LEHEN"]
[null,"AUFSEß","HOCHSTAHL",472115,2404,"",null,"EPPENSCHLAG"]
[null,"AUFSEß","ZOCHENREUTH",472115,2405,"",null,"EPPISHAUSEN"]
[null,"AUFSEß","SCHRESSENDORF",472115,2406,"",null,"ERBENDORF"]
[null,"AUGSBURG","AUGSBURG",761000,7286,{"$f":"+IF(A450<>\"\",1,\"\")","v":""},null,"ERDING"]
[null,"AUGSBURG","OBERHAUSEN",761000,7287,"",null,"ERDWEG"]
[null,"AUGSBURG","LECHHAUSEN",761000,7288,"",null,"ERESING"]
[null,"AUGSBURG","KRIEGSHABER",761000,7289,"",null,"ERGERSHEIM"]
[null,"AUGSBURG","PFERSEE",761000,7290,"",null,"ERGOLDING"]
[null,"AUGSBURG","HOCHZOLL",761000,7291,"",null,"ERGOLDSBACH"]
[null,"AUGSBURG","GÖGGINGEN",761000,7292,"",null,"ERHARTING"]
[null,"AUGSBURG","BERGHEIM",761000,7293,"",null,"ERING"]
[null,"AUGSBURG","INNINGEN",761000,7294,"",null,"ERKHEIM"]
[null,"AUGSBURG","HAUNSTETTEN",761000,7295,"",null,"ERLABRUNN"]
[null,"AUGSBURG","MERINGERAU",761000,7296,"",null,"ERLANGEN"]
[null,"AUHAUSEN","DORNSTADT-LINKERSBAINDT",779117,6707,"",null,"ERLBACH"]
[null,"AUHAUSEN","AUHAUSEN",779117,6708,"",null,"ERLENBACH A.MAIN"]
[null,"AUHAUSEN","DORNSTADT",779117,6709,"",null,"ERLENBACH B.MARKTHEI"]
[null,"AUHAUSEN","LOCHENBACH",779117,6710,"",null,"ERLENSTEGENER FORST"]
[null,"AURA A.D.SAALE","EUERDORFER FORST",672111,253,"",null,"ERMERSHAUSEN"]
[null,"AURA A.D.SAALE","AURA A.D.SAALE",672111,266,"",null,"ERNSGADEN"]
[null,"AURA I.SINNGRUND","FORST AURA",677116,503,"",null,"ESCHAU"]
[null,"AURA I.SINNGRUND","AURA I.SINNGRUND",677116,505,"",null,"ESCHENBACH I.D.OPF."]
[null,"AURACH","AURACH",571114,3108,"",null,"ESCHENLOHE"]
[null,"AURACH","BÜCHELBERG",571114,3123,"",null,"ESCHLKAM"]
[null,"AURACH","WEINBERG",571114,3237,"",null,"ESLARN"]
[null,"AURACHTAL","FALKENDORF",572114,2776,"",null,"ESSELBACH"]
[null,"AURACHTAL","MÜNCHAURACH",572114,2819,"",null,"ESSENBACH"]
[null,"AURACHTAL","NEUNDORF",572114,2821,"",null,"ESSING"]
[null,"AURACHTAL","UNTERREICHENBACH",572114,2837,"",null,"ESTENFELD"]
[null,"AUßERNZELL","AUßERNZELL",271114,5952,"",null,"ESTERHOLZ"]
[null,"AUWALD","AUWALD",775451,7507,"",null,"ETTAL"]
[null,"AYING","PEIß",184137,8697,"",null,"ETTALER FORST"]
[null,"AYING","HELFENDORF",184137,8713,"",null,"ETTENSTATT"]
[null,"AYSTETTEN","AYSTETTEN",772117,7249,"",null,"ETTRINGEN"]
[null,"BAAR","UNTERBAAR",771176,6991,"",null,"ETZELWANG"]
[null,"BAAR","OBERBAAR",771176,6992,"",null,"ETZENRICHT"]
[null,"BAAR","HEIMPERSDORF",771176,6994,"",null,"EUERBACH"]
[null,"BAAR-EBENHAUSEN","EBENHAUSEN",186113,8068,"",null,"EUERDORF"]
[null,"BAAR-EBENHAUSEN","BAAR",186113,8069,"",null,"EUERDORFER FORST"]
[null,"BABENHAUSEN","KLOSTERBEUREN",778115,7540,"",null,"EURASBURG"]
[null,"BABENHAUSEN","BABENHAUSEN",778115,7541,"",null,"EUßENHEIM"]
[null,"BABENSHAM","BABENSHAM",187116,9756,"",null,"FABRIK-SCHLEICHACHER FORST-NO"]
[null,"BABENSHAM","SCHAMBACH",187116,9757,"",null,"FABRIK-SCHLEICHACHER FORST-SW"]
[null,"BABENSHAM","PENZING",187116,9758,"",null,"FAHRENZHAUSEN"]
[null,"BABENSHAM","KLING",187116,9760,"",null,"FALKENBERG"]
[null,"BABENSHAM","LOIBERSDORF",187116,9762,"",null,"FALKENFELS"]
[null,"BABENSHAM","TITLMOOS",187116,9763,"",null,"FALKENSTEIN"]
[null,"BABENSHAM","SCHÖNBERG",187116,9769,"",null,"FARCHANT"]
[null,"BACH A.D.DONAU","BACH A.D.DONAU",375116,5207,"",null,"FAULBACH"]
[null,"BACH A.D.DONAU","DEMLING",375116,5219,"",null,"FEICHTEN A.D.ALZ"]
[null,"BACH A.D.DONAU","FORSTMÜHLER FORST",375116,5231,"",null,"FEILITZSCH"]
[null,"BACH A.D.DONAU","FRENGKOFEN",375116,5234,"",null,"FELDAFING"]
[null,"BACHHAGEL","BURGHAGEL",773112,6838,"",null,"FELDKIRCHEN"]
[null,"BACHHAGEL","BACHHAGEL",773112,6839,"",null,"FELDKIRCHEN-WESTERHA"]
[null,"BACHHAGEL","OBERBECHINGEN",773112,6840,"",null,"FELLEN"]
[null,"BÄCHINGEN A.D.BRENZ","BÄCHINGEN A.D.BRENZ",773113,6852,"",null,"FELLHEIM"]
[null,"BAD ABBACH","BAD ABBACH",273116,6012,"",null,"FENSTERBACH"]
[null,"BAD ABBACH","DÜNZLING",273116,6016,"",null,"FEUCHT"]
[null,"BAD ABBACH","LENGFELD",273116,6049,"",null,"FEUCHTER FORST"]
[null,"BAD ABBACH","OBERNDORF",273116,6068,"",null,"FEUCHTWANGEN"]
[null,"BAD ABBACH","PEISING",273116,6075,"",null,"FICHTELBERG"]
[null,"BAD ABBACH","POIKAM",273116,6079,"",null,"FICHTER U.HEID"]
[null,"BAD ABBACH","SAALHAUPT",273116,6086,"",null,"FINNING"]
[null,"BAD AIBLING","BAD AIBLING",187117,9604,"",null,"FINNINGEN"]
[null,"BAD AIBLING","DETTENDORF",187117,9612,"",null,"FINSING"]
[null,"BAD AIBLING","ELLMOSEN",187117,9614,"",null,"FISCHACH"]
[null,"BAD AIBLING","HARTHAUSEN",187117,9629,"",null,"FISCHBACH"]
[null,"BAD AIBLING","MIETRACHING",187117,9650,{"$f":"+IF(A514<>\"\",1,\"\")","v":""},null,"FISCHBACHAU"]
[null,"BAD AIBLING","WILLING",187117,9684,"",null,"FISCHEN I.ALLGÄU"]
[null,"BAD ALEXANDERSBAD","BAD ALEXANDERSBAD",479111,2065,"",null,"FLACHSLANDEN"]
[null,"BAD ALEXANDERSBAD","LEUTENDORF",479111,2066,"",null,"FLADUNGEN"]
[null,"BAD BERNECK I.FICHTE","WASSERKNODEN",472116,2361,"",null,"FLINTSBACH A.INN"]
[null,"BAD BERNECK I.FICHTE","RIMLAS",472116,2362,"",null,"FLOß"]
[null,"BAD BERNECK I.FICHTE","BAD BERNECK I.FICHTELGEBIRGE",472116,2363,"",null,"FLOSSENBÜRG"]
[null,"BAD BERNECK I.FICHTE","BÄRNREUTH",472116,2364,"",null,"FLÖTZ"]
[null,"BAD BERNECK I.FICHTE","NENNTMANNSREUTH",472116,2365,"",null,"FORCHHEIM"]
[null,"BAD BERNECK I.FICHTE","NEUDORF",472116,2366,"",null,"FORHEIM"]
[null,"BAD BERNECK I.FICHTE","GOLDMÜHL",472116,2367,"",null,"FORST AURA"]
[null,"BAD BERNECK I.FICHTE","ESCHERLICH",472116,2368,"",null,"FORST DETTER-SÜD"]
[null,"BAD BERNECK I.FICHTE","GOLDKRONACHER FORST",472116,2383,"",null,"FORST HAIN I.SPESSART"]
[null,"BAD BIRNBACH","ASENHAM",277113,6403,"",null,"FORST KASTEN"]
[null,"BAD BIRNBACH","BROMBACH",277113,6405,"",null,"FORST KLEINSCHWARZENLOHE"]
[null,"BAD BIRNBACH","HIRSCHBACH",277113,6422,"",null,"FORST LOHRERSTRAßE"]
[null,"BAD BIRNBACH","BAD BIRNBACH",277113,6484,"",null,"FORST NEUSTÄDTLEIN A.FORST"]
[null,"BAD BIRNBACH","UNTERTATTENBACH",277113,6487,"",null,"FORST SANKT ZENO"]
[null,"BAD BOCKLET","STEINACH",672112,179,"",null,"FORST SCHMALWASSER-NORD"]
[null,"BAD BOCKLET","NICKERSFELDEN",672112,180,"",null,"FORST SCHMALWASSER-SÜD"]
[null,"BAD BOCKLET","ROTH A.D.SAALE",672112,184,"",null,"FORST SCHWARZENBACH A.WALD"]
[null,"BAD BOCKLET","KLAUSWALD-NORD",672112,190,"",null,"FORST TENNENLOHE"]
[null,"BAD BOCKLET","HOHN",672112,191,"",null,"FORST THIERGARTEN"]
[null,"BAD BOCKLET","ASCHACH",672112,203,"",null,"FORSTENRIEDER PARK"]
[null,"BAD BOCKLET","BAD BOCKLET",672112,204,"",null,"FORSTERN"]
[null,"BAD BOCKLET","GROßENBRACH",672112,216,"",null,"FORSTHOF"]
[null,"BAD BOCKLET","KLAUSWALD-SÜD",672112,232,"",null,"FORSTINNING"]
[null,"BAD BRÜCKENAU","SPEICHERZ",672113,158,"",null,"FORSTMÜHLER FORST"]
[null,"BAD BRÜCKENAU","RÖMERSHAGER FORST-NORD",672113,161,"",null,"FORSTWALD"]
[null,"BAD BRÜCKENAU","VOLKERS",672113,163,"",null,"FRAMMERSBACH"]
[null,"BAD BRÜCKENAU","RÖMERSHAGER FORST-WEST",672113,165,"",null,"FRAMMERSBACHER FORST"]
[null,"BAD BRÜCKENAU","RÖMERSHAG",672113,166,"",null,"FRANKENWINHEIM"]
[null,"BAD BRÜCKENAU","BAD BRÜCKENAU",672113,167,"",null,"FRASDORF"]
[null,"BAD BRÜCKENAU","RÖMERSHAGER FORST-OST",672113,168,"",null,"FRAUENAU"]
[null,"BAD BRÜCKENAU","WERNARZ",672113,173,"",null,"FRAUENBERGER/DUSCHLBERGER WALD"]
[null,"BAD BRÜCKENAU","RÖMERSHAGER FORST-SÜD",672113,174,"",null,"FRAUENFORST"]
[null,"BAD BRÜCKENAU","OBERLEICHTERSBACH",672113,183,"",null,"FRAUENNEUHARTING"]
[null,"BAD ENDORF","BAD ENDORF",187128,9615,"",null,"FRAUNBERG"]
[null,"BAD ENDORF","HEMHOF",187128,9631,"",null,"FREIHÖLSER FORST"]
[null,"BAD ENDORF","HIRNSBERG",187128,9632,"",null,"FREIHUNG"]
[null,"BAD ENDORF","MAUERKIRCHEN I.CHIEMGAU",187128,9649,"",null,"FREILASSING"]
[null,"BAD ENDORF","PIETZING",187128,9659,"",null,"FREISING"]
[null,"BAD FEILNBACH","AU B.BAD AIBLING",187129,9603,"",null,"FREMDINGEN"]
[null,"BAD FEILNBACH","DETTENDORF",187129,9612,"",null,"FRENSDORF"]
[null,"BAD FEILNBACH","BAD FEILNBACH",187129,9616,"",null,"FREUDENBERG"]
[null,"BAD FEILNBACH","LITZLDORF",187129,9646,"",null,"FREYSTADT"]
[null,"BAD FEILNBACH","WIECHS",187129,9682,"",null,"FREYUNG"]
[null,"BAD FÜSSING","SAFFERSTETTEN",275116,6534,"",null,"FRICKENHAUSEN A.MAIN"]
[null,"BAD FÜSSING","WÜRDING",275116,6535,"",null,"FRIDOLFING"]
[null,"BAD FÜSSING","AIGEN A.INN",275116,6536,"",null,"FRIEDBERG"]
[null,"BAD FÜSSING","EGGLFING A.INN",275116,6537,"",null,"FRIEDENFELS"]
[null,"BAD GRIESBACH I.ROTT","SANKT SALVATOR",275124,6368,"",null,"FRIESENRIED"]
[null,"BAD GRIESBACH I.ROTT","REUTERN",275124,6369,"",null,"FRONTENHAUSEN"]
[null,"BAD GRIESBACH I.ROTT","BUCHET",275124,6370,"",null,"FUCHSMÜHL"]
[null,"BAD GRIESBACH I.ROTT","WENG",275124,6371,"",null,"FUCHSSTADT"]
[null,"BAD GRIESBACH I.ROTT","GRIESBACH I.ROTTAL",275124,6372,"",null,"FUCHSTAL"]
[null,"BAD GRIESBACH I.ROTT","KARPFHAM",275124,6373,"",null,"FÜNFSTETTEN"]
[null,"BAD GRÖNENBACH","ZELL",778144,7604,"",null,"FÜRSTENECK"]
[null,"BAD GRÖNENBACH","BAD GRÖNENBACH",778144,7605,"",null,"FÜRSTENFELDBRUCK"]
[null,"BAD HEILBRUNN","MÜRNSEE",173111,9401,"",null,"FÜRSTENSTEIN"]
[null,"BAD HEILBRUNN","BAD HEILBRUNN",173111,9402,"",null,"FÜRSTENZELL"]
[null,"BAD HEILBRUNN","OBERBUCHEN",173111,9403,"",null,"FÜRSTL.LÖWENSTEIN'SCHER PARK"]
[null,"BAD KISSINGEN","KLEINBRACH",672114,228,"",null,"FURTH"]
[null,"BAD KISSINGEN","POPPENROTH",672114,231,"",null,"FÜRTH"]
[null,"BAD KISSINGEN","KLAUSWALD-SÜD",672114,232,{"$f":"+IF(A578<>\"\",1,\"\")","v":""},null,"FURTH I.WALD"]
[null,"BAD KISSINGEN","HAUSEN",672114,233,"",null,"FÜSSEN"]
[null,"BAD KISSINGEN","ALBERTSHAUSEN",672114,245,"",null,"GABLINGEN"]
[null,"BAD KISSINGEN","BAD KISSINGEN",672114,246,"",null,"GACHENBACH"]
[null,"BAD KISSINGEN","WINKELS",672114,247,"",null,"GÄDHEIM"]
[null,"BAD KISSINGEN","EUERDORFER FORST",672114,253,"",null,"GAIMERSHEIM"]
[null,"BAD KISSINGEN","GARITZ",672114,254,"",null,"GAIßACH"]
[null,"BAD KISSINGEN","REITERSWIESEN",672114,255,"",null,"GALLMERSGARTEN"]
[null,"BAD KISSINGEN","ARNSHAUSEN",672114,268,"",null,"GAMMELSDORF"]
[null,"BAD KOHLGRUB","BAD KOHLGRUB",180112,9241,"",null,"GANGKOFEN"]
[null,"BAD KÖNIGSHOFEN I.GR","BAD KÖNIGSHOFEN I.GRABFELD",673141,97,"",null,"GARCHING A.D.ALZ"]
[null,"BAD KÖNIGSHOFEN I.GR","IPTHAUSEN",673141,98,"",null,"GARCHING B.MÜNCHEN"]
[null,"BAD KÖNIGSHOFEN I.GR","EYERSHAUSEN",673141,99,"",null,"GARMISCH-PARTENKIRCH"]
[null,"BAD KÖNIGSHOFEN I.GR","MERKERSHAUSEN",673141,107,"",null,"GARS A.INN"]
[null,"BAD KÖNIGSHOFEN I.GR","ALTHAUSEN",673141,114,"",null,"GATTENDORF"]
[null,"BAD KÖNIGSHOFEN I.GR","AUB",673141,115,"",null,"GAUKÖNIGSHOFEN"]
[null,"BAD KÖNIGSHOFEN I.GR","GABOLSHAUSEN",673141,116,"",null,"GAUTING"]
[null,"BAD KÖNIGSHOFEN I.GR","UNTEREßFELD",673141,117,"",null,"GEBENBACH"]
[null,"BAD KÖNIGSHOFEN I.GR","BUNDORFER FORST",673141,123,"",null,"GEBSATTEL"]
[null,"BAD NEUSTADT A.D.SAA","LEBENHAN",673114,62,"",null,"GEFREES"]
[null,"BAD NEUSTADT A.D.SAA","BRENDLORENZEN",673114,80,"",null,"GEIERSBERG"]
[null,"BAD NEUSTADT A.D.SAA","HERSCHFELD",673114,81,"",null,"GEIERSNEST-OST"]
[null,"BAD NEUSTADT A.D.SAA","BAD NEUSTADT A.D.SAALE",673114,89,"",null,"GEIERSNEST-WEST"]
[null,"BAD NEUSTADT A.D.SAA","MÜHLBACH",673114,90,"",null,"GEIERSTHAL"]
[null,"BAD NEUSTADT A.D.SAA","BAD NEUHAUS",673114,91,"",null,"GEISBERGER FORST"]
[null,"BAD NEUSTADT A.D.SAA","DÜRRNHOF",673114,92,"",null,"GEISELBACH"]
[null,"BAD NEUSTADT A.D.SAA","LÖHRIETH",673114,104,"",null,"GEISELBACHER FORST"]
[null,"BAD NEUSTADT A.D.SAA","BAD NEUSTADT, BERGWERKE",673114,127,"",null,"GEISELHÖRING"]
[null,"BAD REICHENHALL","KARLSTEIN",172114,9947,"",null,"GEISELWIND"]
[null,"BAD REICHENHALL","SANKT ZENO",172114,9948,"",null,"GEISENFELD"]
[null,"BAD REICHENHALL","MARZOLL",172114,9949,"",null,"GEISENHAUSEN"]
[null,"BAD REICHENHALL","BAD REICHENHALL",172114,9950,"",null,"GELCHSHEIM"]
[null,"BAD RODACH","BREITENAU",473158,1317,"",null,"GELDERSHEIM"]
[null,"BAD RODACH","BREITENAUER FORST",473158,1318,"",null,"GELLNHAUSEN"]
[null,"BAD RODACH","ELSA",473158,1343,"",null,"GELTENDORF"]
[null,"BAD RODACH","GAUERSTADT",473158,1354,"",null,"GEMEINDEFREIES GEBIET"]
[null,"BAD RODACH","GRATTSTADT",473158,1361,"",null,"GEMÜNDEN A.MAIN"]
[null,"BAD RODACH","HÄHNLES",473158,1369,"",null,"GENDERKINGEN"]
[null,"BAD RODACH","HELDRITT",473158,1373,"",null,"GEORGENBERG"]
[null,"BAD RODACH","LEMPERTSHAUSEN",473158,1401,"",null,"GEORGENSGMÜND"]
[null,"BAD RODACH","MÄHRENHAUSEN",473158,1405,"",null,"GERACH"]
[null,"BAD RODACH","OETTINGSHAUSEN",473158,1449,"",null,"GERATSKIRCHEN"]
[null,"BAD RODACH","RODACH",473158,1455,"",null,"GERBRUNN"]
[null,"BAD RODACH","ROßFELD",473158,1459,"",null,"GERETSRIED"]
[null,"BAD RODACH","RUDELSDORF",473158,1467,"",null,"GERHARDSHOFEN"]
[null,"BAD RODACH","SÜLZFELD",473158,1491,"",null,"GERLASER FORST"]
[null,"BAD STEBEN","BAD STEBEN",475112,1855,"",null,"GERMARINGEN"]
[null,"BAD STEBEN","THIERBACH",475112,1856,"",null,"GERMERING"]
[null,"BAD STEBEN","BOBENGRÜN",475112,1857,"",null,"GERODA"]
[null,"BAD STEBEN","OBERSTEBEN",475112,1858,"",null,"GEROLDSGRÜN"]
[null,"BAD STEBEN","CARLSGRÜN",475112,1859,"",null,"GEROLDSGRÜNER FORST"]
[null,"BAD STEBEN","GERLASER FORST",475112,1984,"",null,"GEROLDSHAUSEN"]
[null,"BAD TÖLZ","WACKERSBERG",173112,9406,"",null,"GEROLFINGEN"]
[null,"BAD TÖLZ","BAD TÖLZ",173112,9407,"",null,"GEROLSBACH"]
[null,"BAD TÖLZ","KIRCHBICHL",173112,9408,"",null,"GEROLZHOFEN"]
[null,"BAD WIESSEE","BAD WIESSEE",182111,9423,"",null,"GERSTHOFEN"]
[null,"BAD WINDSHEIM","BAD WINDSHEIM",575112,2907,"",null,"GERZEN"]
[null,"BAD WINDSHEIM","BEROLZHEIM",575112,2911,"",null,"GESCHAIDT"]
[null,"BAD WINDSHEIM","HUMPRECHTSAU",575112,2974,"",null,"GESEES"]
[null,"BAD WINDSHEIM","ICKELHEIM",575112,2975,"",null,"GESLAU"]
[null,"BAD WINDSHEIM","KÜLSHEIM",575112,2984,"",null,"GESSERTSHAUSEN"]
[null,"BAD WINDSHEIM","LENKERSHEIM",575112,2989,"",null,"GESTRATZ"]
[null,"BAD WINDSHEIM","OBERNTIEF",575112,3010,"",null,"GIEBELSTADT"]
[null,"BAD WINDSHEIM","RÜDISBRONN",575112,3025,"",null,"GILCHING"]
[null,"BAD WINDSHEIM","WIEBELSHEIM",575112,3065,{"$f":"+IF(A642<>\"\",1,\"\")","v":""},null,"GLASHÜTTEN"]
[null,"BAD WÖRISHOFEN","KIRCHDORF",778116,7803,"",null,"GLASHÜTTENER FORST"]
[null,"BAD WÖRISHOFEN","DORSCHHAUSEN",778116,7804,"",null,"GLATTBACH"]
[null,"BAD WÖRISHOFEN","BAD WÖRISHOFEN",778116,7805,"",null,"GLEIRITSCH"]
[null,"BAD WÖRISHOFEN","STOCKHEIM",778116,7806,"",null,"GLEIßENBERG"]
[null,"BAD WÖRISHOFEN","SCHLINGEN",778116,7807,"",null,"GLONN"]
[null,"BAIERBACH","BAIERBACH",274118,6653,"",null,"GLÖTT"]
[null,"BAIERBRUNN","BAIERBRUNN",184113,9301,"",null,"GMUND A.TEGERNSEE"]
[null,"BAIERN","BAIERN",175113,8753,"",null,"GNOTZHEIM"]
[null,"BAIERSDORF","BAIERSDORF",572115,2755,"",null,"GOCHSHEIM"]
[null,"BAIERSDORF","WELLERSTADT",572115,2847,"",null,"GOLDBACH"]
[null,"BAISWEIL","LAUCHDORF",777114,7837,"",null,"GOLDKRONACH"]
[null,"BAISWEIL","BAISWEIL",777114,7838,"",null,"GOLDKRONACHER FORST"]
[null,"BALDERSCHWANG","BALDERSCHWANG",780113,7985,"",null,"GOLLHOFEN"]
[null,"BALZHAUSEN","BALZHAUSEN",774115,7733,"",null,"GÖRISRIED"]
[null,"BAMBERG","BAMBERG",461000,2109,"",null,"GÖSSENHEIM"]
[null,"BAMBERG","BRUDERWALD",461000,2121,"",null,"GÖßWEINSTEIN"]
[null,"BAMBERG","BUG",461000,2124,"",null,"GOTTESZELL"]
[null,"BAMBERG","DÖRFLEINS",461000,2139,"",null,"GOTTFRIEDING"]
[null,"BAMBERG","GAUSTADT",461000,2162,"",null,"GRABEN"]
[null,"BAMBERG","GUNDELSHEIM",461000,2175,"",null,"GRABENSTÄTT"]
[null,"BAMBERG","HALLSTADT",461000,2179,"",null,"GRÄFELFING"]
[null,"BAMBERG","HAUPTSMOOR",461000,2184,"",null,"GRAFENAU"]
[null,"BAMBERG","MEMMELSDORF",461000,2227,"",null,"GRÄFENBERG"]
[null,"BAMBERG","STRULLENDORF",461000,2299,"",null,"GRAFENBUCHER FORST"]
[null,"BAMBERG","WILDENSORG",461000,2338,"",null,"GRÄFENDORF"]
[null,"BARBING","AUBURG",375117,5205,"",null,"GRAFENGEHAIG"]
[null,"BARBING","BARBING",375117,5208,"",null,"GRAFENRHEINFELD"]
[null,"BARBING","ELTHEIM",375117,5228,"",null,"GRAFENWIESEN"]
[null,"BARBING","FRIESHEIM",375117,5235,"",null,"GRAFENWÖHR"]
[null,"BARBING","ILLKOFEN",375117,5266,"",null,"GRAFING B.MÜNCHEN"]
[null,"BARBING","SARCHING",375117,5322,"",null,"GRAFLING"]
[null,"BÄRNAU","SCHWARZENBACH",377112,4156,"",null,"GRAFRATH"]
[null,"BÄRNAU","ELLENFELD",377112,4157,"",null,"GRAINAU"]
[null,"BÄRNAU","BÄRNAU",377112,4158,"",null,"GRAINET"]
[null,"BÄRNAU","HOHENTHAN",377112,4159,"",null,"GRAINETER WALD"]
[null,"BÄRNAU","THANHAUSEN",377112,4160,"",null,"GRAMSCHATZER WALD"]
[null,"BÄRNHOF","ROTHENBRUCK",371451,3566,"",null,"GRASBRUNN"]
[null,"BASTHEIM","UNTERWALDBEHRUNGEN",673116,35,"",null,"GRASSAU"]
[null,"BASTHEIM","REYERSBACH",673116,43,"",null,"GRATTERSDORF"]
[null,"BASTHEIM","BASTHEIM",673116,44,"",null,"GREDING"]
[null,"BASTHEIM","WECHTERSWINKELER FORST",673116,48,"",null,"GREIFENBERG"]
[null,"BASTHEIM","RÖDLES",673116,49,"",null,"GREILING"]
[null,"BASTHEIM","BRAIDBACH",673116,50,"",null,"GREMSDORF"]
[null,"BASTHEIM","WECHTERSWINKEL",673116,51,"",null,"GRETTSTADT"]
[null,"BAUDENBACH","BAUDENBACH",575113,3251,"",null,"GREUßENHEIM"]
[null,"BAUDENBACH","FRANKENFELD",575113,3252,"",null,"GRIESSTÄTT"]
[null,"BAUDENBACH","ROßBACH",575113,3253,"",null,"GRÖBENZELL"]
[null,"BAUDENBACH","MÖNCHSBERG",575113,3254,"",null,"GROßAITINGEN"]
[null,"BAUDENBACH","HAMBÜHL",575113,3255,"",null,"GROßBARDORF"]
[null,"BAUNACH","APPENDORF",471115,2107,"",null,"GROßEIBSTADT"]
[null,"BAUNACH","BAUNACH",471115,2110,"",null,"GROßENSEEBACH"]
[null,"BAUNACH","DASCHENDORF",471115,2133,"",null,"GROßER AUERSBERG"]
[null,"BAUNACH","DASCHENDORFER FORST",471115,2134,"",null,"GROßHABERSDORF"]
[null,"BAUNACH","DORGENDORF",471115,2141,"",null,"GROßHEIRATH"]
[null,"BAUNACH","LUßBERGER FORST",471115,2221,"",null,"GROßHEUBACH"]
[null,"BAUNACH","PRIEGENDORF",471115,2257,"",null,"GROßKAROLINENFELD"]
[null,"BAUNACH","RECKENNEUSIG",471115,2263,"",null,"GROßLANGHEIM"]
[null,"BAUNACH","STIEFENBERG",471115,2297,"",null,"GROßMEHRING"]
[null,"BAYERBACH","BAYERBACH",277112,6490,"",null,"GROßOSTHEIM"]
[null,"BAYERBACH","KINDLBACH",277112,6491,"",null,"GROßWALLSTADT"]
[null,"BAYERBACH","STEINBERG",277112,6492,"",null,"GROßWEIL"]
[null,"BAYERBACH-ERGOLDSBAC","LANGENHETTENBACH",274119,6572,"",null,"GRUB A.FORST"]
[null,"BAYERBACH-ERGOLDSBAC","BAYERBACH B.ERGOLDSBACH",274119,6577,"",null,"GRÜNENBACH"]
[null,"BAYERBACH-ERGOLDSBAC","MOOSTHANN",274119,6595,{"$f":"+IF(A706<>\"\",1,\"\")","v":""},null,"GRÜNWALD"]
[null,"BAYERISCH EISENSTEIN","BAYERISCH EISENSTEIN",276115,5704,"",null,"GRÜNWALDER FORST"]
[null,"BAYERISCH EISENSTEIN","ZWIESLERWALDHAUS",276115,5717,"",null,"GSTADT A.CHIEMSEE"]
[null,"BAYERISCH GMAIN","BAYERISCH GMAIN",172115,9952,"",null,"GUNDELFINGEN A.D.DON"]
[null,"BAYERISCH GMAIN","FORST SANKT ZENO",172115,9953,"",null,"GUNDELSHEIM"]
[null,"BAYERSOIEN","BAD BAYERSOIEN",180113,9239,"",null,"GUNDREMMINGEN"]
[null,"BAYREUTH","LAINECK",462000,2429,"",null,"GÜNTERSLEBEN"]
[null,"BAYREUTH","OBERPREUSCHWITZ",462000,2430,"",null,"GÜNTHERSBÜHLER FORST"]
[null,"BAYREUTH","BAYREUTH",462000,2431,"",null,"GÜNZACH"]
[null,"BAYREUTH","SANKT JOHANNIS",462000,2432,"",null,"GÜNZBURG"]
[null,"BAYREUTH","MEYERNBERG",462000,2433,"",null,"GUNZENHAUSEN"]
[null,"BAYREUTH","COLMDORF",462000,2434,"",null,"GUTENECK"]
[null,"BAYREUTH","SEULBITZ",462000,2435,"",null,"GUTENSTETTEN"]
[null,"BAYREUTH","AICHIG",462000,2436,"",null,"GUTTENBERG"]
[null,"BAYREUTH","OBERKONNERSREUTH",462000,2437,"",null,"GUTTENBERGER WALD"]
[null,"BAYREUTH","THIERGARTEN",462000,2438,"",null,"HAAG"]
[null,"BAYREUTH","WOLFSBACH",462000,2439,"",null,"HAAG A.D.AMPER"]
[null,"BAYREUTH","BAYREUTH, BERGWERKE",462000,2559,"",null,"HAAG I.OB"]
[null,"BAYRISCHZELL","BAYRISCHZELL",182112,9522,"",null,"HAAR"]
[null,"BECHHOFEN","BECHHOFEN",571115,3109,"",null,"HAARBACH"]
[null,"BECHHOFEN","BIRKACH",571115,3116,"",null,"HABACH"]
[null,"BECHHOFEN","GROßENRIED",571115,3148,"",null,"HACKLBERG"]
[null,"BECHHOFEN","KAUDORF",571115,3168,"",null,"HAFENLOHR"]
[null,"BECHHOFEN","KÖNIGSHOFEN A.D.HEIDE",571115,3175,"",null,"HAGELSTADT"]
[null,"BECHHOFEN","LIEBERSDORF",571115,3182,"",null,"HAGENBÜCHACH"]
[null,"BECHHOFEN","MÖRLACH",571115,3188,"",null,"HAHNBACH"]
[null,"BECHHOFEN","SACHSBACH",571115,3213,"",null,"HAIBACH"]
[null,"BECHHOFEN","THANN",571115,3225,"",null,"HAIDMÜHLE"]
[null,"BECHHOFEN","WAIZENDORF",571115,3233,"",null,"HAIMENDORFER FORST"]
[null,"BECHHOFEN","WIESETHBRUCK",571115,3243,"",null,"HAIMHAUSEN"]
[null,"BECHTSRIETH","BECHTSRIETH",374170,4399,"",null,"HAIMING"]
[null,"BECHTSRIETH","TREBSAU",374170,4400,"",null,"HAINSFARTH"]
[null,"BEHRINGERSDORFER FORST","BEHRINGERSDORFER FORST",574451,3509,"",null,"HAINSTETTER WALD"]
[null,"BEILNGRIES","LITTERZHOFEN",176114,3951,"",null,"HALBLECH"]
[null,"BEILNGRIES","BIBERBACH",176114,3952,"",null,"HALDENWANG"]
[null,"BEILNGRIES","KEVENHÜLL",176114,3953,"",null,"HALFING"]
[null,"BEILNGRIES","WIESENHOFEN",176114,3954,"",null,"HALLBERGMOOS"]
[null,"BEILNGRIES","HIRSCHBERG",176114,3955,"",null,"HALLERNDORF"]
[null,"BEILNGRIES","BEILNGRIES",176114,3956,"",null,"HALLSTADT"]
[null,"BEILNGRIES","KOTTINGWÖRTH",176114,3957,"",null,"HALSBACH"]
[null,"BEILNGRIES","PAULUSHOFEN",176114,3958,"",null,"HAMMELBURG"]
[null,"BEILNGRIES","IRFERSDORF",176114,3959,"",null,"HAPPURG"]
[null,"BEILNGRIES","NEUZELL",176114,3960,"",null,"HARBURG I.SCHWABEN"]
[null,"BEILNGRIES","AMTMANNSDORF",176114,3961,"",null,"HARSDORF"]
[null,"BEILNGRIES","ASCHBUCH",176114,3962,"",null,"HART"]
[null,"BEILNGRIES","EGLOFSDORF",176114,3963,"",null,"HARTENSTEIN"]
[null,"BEILNGRIES","WOLFSBUCH",176114,3964,"",null,"HASELBACH"]
[null,"BEILNGRIES","GRAMPERSDORF",176114,3965,"",null,"HASLOCH"]
[null,"BEILNGRIES","ARNBUCH",176114,3966,"",null,"HAßFURT"]
[null,"BELLENBERG","BELLENBERG",775115,7506,"",null,"HATTENHOFEN"]
[null,"BENEDIKTBEUERN","BENEDIKTBEUERN",173113,9414,"",null,"HAUNDORF"]
[null,"BENNINGEN","BENNINGEN",778118,7579,"",null,"HAUNSHEIM"]
[null,"BENNINGEN","HAWANGEN",778118,7582,"",null,"HAUNSTETTER FORST"]
[null,"BERATZHAUSEN","SCHWARZENTHONHAUSEN",375118,5450,"",null,"HAUPTSMOOR"]
[null,"BERATZHAUSEN","OBERPFRAUNDORF",375118,5451,"",null,"HAURAIN"]
[null,"BERATZHAUSEN","MAUSHEIM",375118,5452,"",null,"HAUSEN"]
[null,"BERATZHAUSEN","BERATZHAUSEN",375118,5453,"",null,"HAUSEN B.WÜRZBURG"]
[null,"BERATZHAUSEN","RECHBERG",375118,5454,"",null,"HAUSHAM"]
[null,"BERATZHAUSEN","BEILNSTEIN",375118,5455,"",null,"HAUZENBERG"]
[null,"BERATZHAUSEN","HAAG",375118,5485,"",null,"HAWANGEN"]
[null,"BERCHING","ALTMANNSBERG",373112,4601,"",null,"HEBERTSFELDEN"]
[null,"BERCHING","BERCHING",373112,4604,"",null,"HEBERTSHAUSEN"]
[null,"BERCHING","BUCH",373112,4608,"",null,"HEIDECK"]
[null,"BERCHING","ERASBACH",373112,4616,"",null,"HEIDENBERG"]
[null,"BERCHING","ERNERSDORF",373112,4617,{"$f":"+IF(A770<>\"\",1,\"\")","v":""},null,"HEIDENHEIM"]
[null,"BERCHING","FRIBERTSHOFEN",373112,4621,"",null,"HEIGENBRÜCKEN"]
[null,"BERCHING","HAAR",373112,4628,"",null,"HEILIGENSTADT I.OFR."]
[null,"BERCHING","HOLNSTEIN",373112,4635,"",null,"HEILSBRONN"]
[null,"BERCHING","OENING",373112,4662,"",null,"HEIMBUCHENTHAL"]
[null,"BERCHING","PLANKSTETTEN",373112,4668,"",null,"HEIMENKIRCH"]
[null,"BERCHING","POLLANTEN",373112,4669,"",null,"HEIMERTINGEN"]
[null,"BERCHING","RAITENBUCH",373112,4674,"",null,"HEINERSREUTH"]
[null,"BERCHING","RUDERTSHOFEN",373112,4680,"",null,"HEINERSREUTHER FORST"]
[null,"BERCHING","SOLLNGRIESBACH",373112,4685,"",null,"HEINRICHSTHAL"]
[null,"BERCHING","STAUFERSBUCH",373112,4688,"",null,"HEINRICHSTHALER FORST"]
[null,"BERCHING","STIERBAUM",373112,4689,"",null,"HELDENSTEIN"]
[null,"BERCHING","THANN",373112,4693,"",null,"HELMBRECHTS"]
[null,"BERCHING","WALLNSDORF",373112,4700,"",null,"HELMSTADT"]
[null,"BERCHING","WATTENBERG",373112,4703,"",null,"HEMAU"]
[null,"BERCHING","WINTERZHOFEN",373112,4705,"",null,"HEMHOFEN"]
[null,"BERCHING","WEIDENWANG",373112,4706,"",null,"HEMMERSHEIM"]
[null,"BERCHTESGADEN","MARIA GERN",172116,9962,"",null,"HENDUNGEN"]
[null,"BERCHTESGADEN","AU",172116,9963,"",null,"HENFENFELD"]
[null,"BERCHTESGADEN","SALZBERG",172116,9964,"",null,"HENGERSBERG"]
[null,"BERCHTESGADEN","BERCHTESGADEN",172116,9965,"",null,"HEPBERG"]
[null,"BERCHTESGADEN","ECK",172116,9966,"",null,"HERBSTADT"]
[null,"BERG (LKR. HO)","BERG",475113,1865,"",null,"HERETSRIED"]
[null,"BERG (LKR. HO)","HADERMANNSGRÜN",475113,1866,"",null,"HERGATZ"]
[null,"BERG (LKR. HO)","EISENBÜHL",475113,1867,"",null,"HERGENSWEILER"]
[null,"BERG (LKR. HO)","RUDOLPHSTEIN",475113,1868,"",null,"HEROLDSBACH"]
[null,"BERG (LKR. HO)","TIEFENGRÜN",475113,1869,"",null,"HEROLDSBERG"]
[null,"BERG (LKR. HO)","SCHNARCHENREUTH",475113,1870,"",null,"HERRIEDEN"]
[null,"BERG (LKR. HO)","GOTTSMANNSGRÜN",475113,1871,"",null,"HERRNGIERSDORF"]
[null,"BERG (LKR. HO)","BUG B.BERG",475113,1872,"",null,"HERRNWALD"]
[null,"BERG (LKR. HO)","BRUCK",475113,1873,"",null,"HERRSCHING A.AMMERSE"]
[null,"BERG (LKR. STA)","KEMPFENHAUSEN",188113,9186,"",null,"HERSBRUCK"]
[null,"BERG (LKR. STA)","WADLHAUSER GRÄBEN",188113,9187,"",null,"HERZOGENAURACH"]
[null,"BERG (LKR. STA)","BERG",188113,9190,"",null,"HEßDORF"]
[null,"BERG (LKR. STA)","BACHHAUSEN",188113,9191,"",null,"HESSENREUTHER FORST"]
[null,"BERG (LKR. STA)","HÖHENRAIN",188113,9195,"",null,"HETTENSHAUSEN"]
[null,"BERG B.NEUMARKT I.D.","BERG B.NEUMARKT I.D.OPF.",373113,4605,"",null,"HETTSTADT"]
[null,"BERG B.NEUMARKT I.D.","HAIMBURG",373113,4629,"",null,"HETZLES"]
[null,"BERG B.NEUMARKT I.D.","HÄUSELSTEIN",373113,4630,"",null,"HEUSTREU"]
[null,"BERG B.NEUMARKT I.D.","HAUSHEIM",373113,4631,"",null,"HIENHEIMER FORST"]
[null,"BERG B.NEUMARKT I.D.","LODERBACH",373113,4646,"",null,"HILGERTSHAUSEN-TANDE"]
[null,"BERG B.NEUMARKT I.D.","OBERÖLSBACH",373113,4659,"",null,"HILPOLTSTEIN"]
[null,"BERG B.NEUMARKT I.D.","SINDLBACH",373113,4684,"",null,"HILTENFINGEN"]
[null,"BERG B.NEUMARKT I.D.","STÖCKELSBERG",373113,4690,"",null,"HILTPOLTSTEIN"]
[null,"BERG I.GAU","BERG IM GAU",185116,8105,"",null,"HIMMELKRON"]
[null,"BERGEN (LKR. TS)","BERGEN",189113,9860,"",null,"HIMMELSTADT"]
[null,"BERGEN (LKR. TS)","BERGENER FORST",189113,9861,"",null,"HINDELANG"]
[null,"BERGEN (LKR. TS)","HOLZHAUSEN",189113,9862,"",null,"HINTERSCHMIDING"]
[null,"BERGEN (LKR. WUG)","GEYERN",577115,3719,"",null,"HIRSCHAID"]
[null,"BERGEN (LKR. WUG)","BERGEN",577115,3720,"",null,"HIRSCHAU"]
[null,"BERGEN (LKR. WUG)","THALMANNSFELD",577115,3721,"",null,"HIRSCHBACH"]
[null,"BERGEN (LKR. WUG)","KALTENBUCH",577115,3722,"",null,"HIRSCHWALD"]
[null,"BERGHEIM","BERGEN",185118,8071,"",null,"HITZHOFEN"]
[null,"BERGHEIM","UNTERSTALL",185118,8080,"",null,"HÖCHBERG"]
[null,"BERGHEIM","BERGHEIM",185118,8081,"",null,"HÖCHHEIM"]
[null,"BERGKIRCHEN","BERGKIRCHEN",174113,8606,"",null,"HÖCHSTADT A.D.AISCH"]
[null,"BERGKIRCHEN","EISOLZRIED",174113,8612,"",null,"HÖCHSTÄDT A.D.DONAU"]
[null,"BERGKIRCHEN","FELDGEDING",174113,8614,"",null,"HOCHSTADT A.MAIN"]
[null,"BERGKIRCHEN","GÜNDING",174113,8620,"",null,"HÖCHSTÄDT-THIERSHEIM"]
[null,"BERGKIRCHEN","KREUZHOLZHAUSEN",174113,8626,"",null,"HOF"]
[null,"BERGKIRCHEN","LAUTERBACH",174113,8628,"",null,"HOFHEIM I.UFR."]
[null,"BERGKIRCHEN","OBERBACHERN",174113,8631,"",null,"HOFKIRCHEN"]
[null,"BERGLERN","BERGLERN",177112,8354,"",null,"HOFOLDINGER FORST"]
[null,"BERGRHEINFELD","BERGRHEINFELD",678115,932,"",null,"HOFSTETTEN"]
[null,"BERGRHEINFELD","GARSTADT",678115,979,{"$f":"+IF(A834<>\"\",1,\"\")","v":""},null,"HOHE BERG"]
[null,"BERGTHEIM","OPFERBAUM",679117,662,"",null,"HOHE WART"]
[null,"BERGTHEIM","BERGTHEIM",679117,671,"",null,"HOHENALTHEIM"]
[null,"BERGTHEIM","DIPBACH",679117,672,"",null,"HOHENAU"]
[null,"BERNAU A.CHIEMSEE","BERNAU A.CHIEMSEE",187118,9605,"",null,"HOHENBERG A.D.EGER"]
[null,"BERNAU A.CHIEMSEE","HITTENKIRCHEN",187118,9633,"",null,"HOHENBERGER FORST"]
[null,"BERNBEUREN","AUERBERG",190114,9082,"",null,"HOHENBRUNN"]
[null,"BERNBEUREN","BERNBEUREN",190114,9083,"",null,"HOHENBURG"]
[null,"BERNBEUREN","ECHERSCHWANG",190114,9087,"",null,"HOHENFELS"]
[null,"BERNGAU","BERNGAU",373114,4606,"",null,"HOHENFURCH"]
[null,"BERNGAU","MITTELRICHT",373114,4649,"",null,"HOHENKAMMER"]
[null,"BERNGAU","RÖCKERSBÜHL",373114,4678,"",null,"HÖHENKIRCHEN"]
[null,"BERNGAU","WOFFENBACH",373114,4704,"",null,"HÖHENKIRCHENER FORST"]
[null,"BERNHARDSWALD","ADLMANNSTEIN",375119,5201,"",null,"HOHENLINDEN"]
[null,"BERNHARDSWALD","BERNHARDSWALD",375119,5210,"",null,"HOHENPEIßENBERG"]
[null,"BERNHARDSWALD","BIRKENZANT",375119,5211,"",null,"HOHENPOLDING"]
[null,"BERNHARDSWALD","ERLBACH",375119,5229,"",null,"HOHENROTH"]
[null,"BERNHARDSWALD","GÖPPENBACH",375119,5241,"",null,"HOHENTHANN"]
[null,"BERNHARDSWALD","HACKENBERG",375119,5250,"",null,"HOHENWART"]
[null,"BERNHARDSWALD","HAUZENDORF",375119,5258,"",null,"HOHENWARTH"]
[null,"BERNHARDSWALD","KREUTH",375119,5274,"",null,"HOHER BERG"]
[null,"BERNHARDSWALD","KÜRN",375119,5276,"",null,"HOLLENBACH"]
[null,"BERNHARDSWALD","LAMBERTSNEUKIRCHEN",375119,5277,"",null,"HOLLFELD"]
[null,"BERNHARDSWALD","PETTENREUTH",375119,5299,"",null,"HOLLSTADT"]
[null,"BERNHARDSWALD","PLITTING",375119,5307,"",null,"HOLZGÜNZ"]
[null,"BERNHARDSWALD","WOLFERSDORF",375119,5353,"",null,"HOLZHEIM"]
[null,"BERNHARDSWALD","WULKERSDORF",375119,5356,"",null,"HOLZHEIM A.FORST"]
[null,"BERNRIED (LKR. DEG)","BERNRIED",271116,5901,"",null,"HOLZKIRCHEN"]
[null,"BERNRIED (LKR. DEG)","EDENSTETTEN",271116,5902,"",null,"HOPFERAU"]
[null,"BERNRIED (LKR. DEG)","EGG",271116,5903,"",null,"HORGAU"]
[null,"BERNRIED (LKR. WM)","BERNRIED",190115,9212,"",null,"HÖRGERTSHAUSEN"]
[null,"BESSENBACH","KEILBERG",671112,371,"",null,"HÖSBACH"]
[null,"BESSENBACH","STRAßBESSENBACH",671112,379,"",null,"HÖSLWANG"]
[null,"BESSENBACH","OBERBESSENBACH",671112,380,"",null,"HÖTTINGEN"]
[null,"BETZENSTEIN","OTTENBERG",472118,2548,"",null,"HUCKELHEIMER WALD"]
[null,"BETZENSTEIN","WEIDENSEES",472118,2549,"",null,"HUGLFING"]
[null,"BETZENSTEIN","LEUPOLDSTEIN",472118,2550,"",null,"HUISHEIM"]
[null,"BETZENSTEIN","STIERBERG",472118,2551,"",null,"HUMMELTAL"]
[null,"BETZENSTEIN","BETZENSTEIN",472118,2552,"",null,"HUNDELSHAUSEN"]
[null,"BETZENSTEIN","SPIES",472118,2553,"",null,"HUNDERDORF"]
[null,"BETZIGAU","BETZIGAU",780114,7665,"",null,"HUNDING"]
[null,"BEUTELSBACH","BEUTELSBACH",275117,6271,"",null,"HURLACH"]
[null,"BIBERBACH","MARKT",772121,7002,"",null,"HUTTHURM"]
[null,"BIBERBACH","BIBERBACH",772121,7003,"",null,"ICHENHAUSEN"]
[null,"BIBERBACH","EISENBRECHTSHOFEN",772121,7004,"",null,"ICKING"]
[null,"BIBERBACH","FEIGENHOFEN",772121,7005,"",null,"IFFELDORF"]
[null,"BIBERBACH","AFFALTERN",772121,7006,"",null,"IGENSDORF"]
[null,"BIBERTAL","ECHLISHAUSEN",774119,7134,"",null,"IGGENSBACH"]
[null,"BIBERTAL","BÜHL",774119,7135,"",null,"IGLING"]
[null,"BIBERTAL","SILHEIM",774119,7136,"",null,"IHRLERSTEIN"]
[null,"BIBERTAL","KLEINKISSENDORF",774119,7137,"",null,"ILLERTISSEN"]
[null,"BIBERTAL","SCHNECKENHOFEN",774119,7138,"",null,"ILLESHEIM"]
[null,"BIBERTAL","GROßKISSENDORF",774119,7139,"",null,"ILLSCHWANG"]
[null,"BIBERTAL","ETTLISHOFEN",774119,7140,"",null,"ILMMÜNSTER"]
[null,"BIBERTAL","ANHOFEN",774119,7141,"",null,"IMMENREUTH"]
[null,"BIBURG","ALTDÜRNBUCH",273119,6005,"",null,"IMMENSTADT I.ALLGÄU"]
[null,"BIBURG","BIBURG",273119,6015,"",null,"INCHENHOFEN"]
[null,"BICHL","BICHL",173115,9413,"",null,"INGENRIED"]
[null,"BIDINGEN","BERNBACH",777118,7876,"",null,"INGOLSTADT"]
[null,"BIDINGEN","BIDINGEN",777118,7877,"",null,"INNERNZELL"]
[null,"BIEBELRIED","BIEBELRIED",675113,1148,"",null,"INNING A.AMMERSEE"]
[null,"BIEBELRIED","WESTHEIM",675113,1164,"",null,"INNING A.HOLZ"]
[null,"BIEBELRIED","KALTENSONDHEIM",675113,1165,"",null,"INSINGEN"]
[null,"BIEBEREHREN","BIEBEREHREN",679118,775,"",null,"INZELL"]
[null,"BIEBEREHREN","BUCH",679118,776,{"$f":"+IF(A898<>\"\",1,\"\")","v":""},null,"IPHOFEN"]
[null,"BIEBEREHREN","KLINGEN",679118,778,"",null,"IPPESHEIM"]
[null,"BIESSENHOFEN","EBENHOFEN",777112,7874,"",null,"IPSHEIM"]
[null,"BIESSENHOFEN","ALTDORF",777112,7875,"",null,"IRCHENRIETH"]
[null,"BINDLACH","BENK",472119,2373,"",null,"IRLBACH"]
[null,"BINDLACH","RAMSENTHAL",472119,2374,"",null,"IRSCHENBERG"]
[null,"BINDLACH","CROTTENDORF",472119,2375,"",null,"IRSEE"]
[null,"BINDLACH","EUBEN",472119,2376,"",null,"IRTENBERGER WALD"]
[null,"BINDLACH","BINDLACH",472119,2377,"",null,"ISEN"]
[null,"BINSWANGEN","BINSWANGEN",773116,6874,"",null,"ISMANING"]
[null,"BIRGLAND","FÜRNRIED",371116,4504,"",null,"ISSIGAU"]
[null,"BIRGLAND","SUNZENDORF",371116,4505,"",null,"ITZGRUND"]
[null,"BIRGLAND","FRECHETSFELD",371116,4506,"",null,"JACHENAU"]
[null,"BIRGLAND","ECKELTSHOF",371116,4525,"",null,"JANDELSBRUNN"]
[null,"BIRGLAND","POPPBERG",371116,4526,"",null,"JENGEN"]
[null,"BIRGLAND","SCHWEND",371116,4527,"",null,"JESENWANG"]
[null,"BIRKACH","SCHIRNSDORF",572451,2832,"",null,"JETTENBACH"]
[null,"BIRKENFELD","BILLINGSHAUSEN",677119,595,"",null,"JETTINGEN-SCHEPPACH"]
[null,"BIRKENFELD","BIRKENFELD",677119,596,"",null,"JETZENDORF"]
[null,"BIRNBAUM","EFFELTER",476451,1581,"",null,"JOHANNESBERG"]
[null,"BISCHBERG","BISCHBERG",471117,2115,"",null,"JOHANNISKIRCHEN"]
[null,"BISCHBERG","TROSDORF",471117,2312,"",null,"JULBACH"]
[null,"BISCHBERG","TÜTSCHENGEREUTH",471117,2314,"",null,"KACHELSTEIN U.BAUMBURGER WALD"]
[null,"BISCHBRUNN","FÜRSTL.LÖWENSTEIN'SCHER PARK",677120,574,"",null,"KAHL A.MAIN"]
[null,"BISCHBRUNN","BISCHBRUNNER FORST",677120,586,"",null,"KAISERHAMMER FORST-OST"]
[null,"BISCHBRUNN","BISCHBRUNN",677120,587,"",null,"KAISHEIM"]
[null,"BISCHBRUNN","OBERNDORF",677120,588,"",null,"KÄLBERBERG"]
[null,"BISCHBRUNNER FORST","BISCHBRUNNER FORST",677451,586,"",null,"KALCHREUTH"]
[null,"BISCHOFSGRÜN","WÜLFERSREUTH",472121,2369,"",null,"KALCHREUTHER FORST"]
[null,"BISCHOFSGRÜN","BISCHOFSGRÜN",472121,2370,"",null,"KALLMÜNZ"]
[null,"BISCHOFSGRÜNER FORST","BISCHOFSGRÜNER FORST",472451,2371,"",null,"KALTENTAL"]
[null,"BISCHOFSHEIM A.D.RHÖ","OBERWEIßENBRUNN",673117,28,"",null,"KAMMELTAL"]
[null,"BISCHOFSHEIM A.D.RHÖ","FRANKENHEIM",673117,29,"",null,"KAMMERSTEIN"]
[null,"BISCHOFSHEIM A.D.RHÖ","BISCHOFSHEIM A.D.RHÖN",673117,30,"",null,"KAMMLACH"]
[null,"BISCHOFSHEIM A.D.RHÖ","HASELBACH I.D.RHÖN",673117,39,"",null,"KARBACH"]
[null,"BISCHOFSHEIM A.D.RHÖ","UNTERWEIßENBRUNN",673117,40,"",null,"KARLSFELD"]
[null,"BISCHOFSHEIM A.D.RHÖ","WEGFURT",673117,41,"",null,"KARLSHULD"]
[null,"BISCHOFSMAIS","HABISCHRIED",276116,5752,"",null,"KARLSKRON"]
[null,"BISCHOFSMAIS","BISCHOFSMAIS",276116,5753,"",null,"KARLSTADT"]
[null,"BISCHOFSMAIS","HOCHDORF",276116,5754,"",null,"KARLSTEIN A.MAIN"]
[null,"BISCHOFSWIESEN","BISCHOFSWIESEN",172117,9956,"",null,"KARSBACH"]
[null,"BISCHOFSWIESENER FORST","BISCHOFSWIESENER FORST",172451,9954,"",null,"KASENDORF"]
[null,"BISSINGEN","OBERRINGINGEN",773117,6801,"",null,"KASTL"]
[null,"BISSINGEN","THALHEIM",773117,6802,"",null,"KAUFBEUREN"]
[null,"BISSINGEN","FRONHOFEN",773117,6803,"",null,"KAUFERING"]
[null,"BISSINGEN","BURGMAGERBEIN",773117,6804,"",null,"KELHEIM"]
[null,"BISSINGEN","GÖLLINGEN",773117,6805,"",null,"KELLMÜNZ A.D.ILLER"]
[null,"BISSINGEN","STILLNAU",773117,6806,"",null,"KEMMERN"]
[null,"BISSINGEN","BUGGENHOFEN",773117,6807,"",null,"KEMNATH"]
[null,"BISSINGEN","ZOLTINGEN",773117,6808,"",null,"KEMPTEN (ALLGÄU)"]
[null,"BISSINGEN","UNTERRINGINGEN",773117,6809,"",null,"KEMPTER WALD"]
[null,"BISSINGEN","LEIHEIM",773117,6810,"",null,"KETTERSHAUSEN"]
[null,"BISSINGEN","DIEMANTSTEIN",773117,6811,"",null,"KIEFERSFELDEN"]
[null,"BISSINGEN","WARNHOFEN",773117,6812,"",null,"KIENBERG"]
[null,"BISSINGEN","HOCHSTEIN",773117,6813,"",null,"KINDING"]
[null,"BISSINGEN","BISSINGEN",773117,6814,"",null,"KINSAU"]
[null,"BISSINGEN","KESSELOSTHEIM",773117,6815,"",null,"KIPFENBERG"]
[null,"BISSINGEN","OBERLIEZHEIM",773117,6816,"",null,"KIRCHANSCHÖRING"]
[null,"BISSINGEN","GAISHARDT",773117,6817,"",null,"KIRCHBERG"]
[null,"BISSINGEN","UNTERBISSINGEN",773117,6818,"",null,"KIRCHBERG I.WALD"]
[null,"BLAIBACH","BLAIBACH",372115,5162,"",null,"KIRCHDORF"]
[null,"BLAIBACH","KREUZBACH",372115,5163,"",null,"KIRCHDORF A.D.AMPER"]
[null,"BLAIBACH","ALLMANNSDORF",372115,5164,"",null,"KIRCHDORF A.INN"]
[null,"BLAICHACH","BLAICHACH",780115,7979,"",null,"KIRCHDORF I.WALD"]
[null,"BLAICHACH","GUNZESRIED",780115,7980,{"$f":"+IF(A962<>\"\",1,\"\")","v":""},null,"KIRCHEHRENBACH"]
[null,"BLANKENBACH","GROßBLANKENBACH",671113,337,"",null,"KIRCHENDEMENREUTH"]
[null,"BLANKENBACH","KLEINBLANKENBACH",671113,338,"",null,"KIRCHENLAMITZ"]
[null,"BLINDHEIM","WOLPERTSTETTEN",773119,6826,"",null,"KIRCHENPINGARTEN"]
[null,"BLINDHEIM","UNTERGLAUHEIM",773119,6827,"",null,"KIRCHENSITTENBACH"]
[null,"BLINDHEIM","BLINDHEIM",773119,6828,"",null,"KIRCHENTHUMBACH"]
[null,"BÖBING","BÖBING",190117,9085,"",null,"KIRCHHAM"]
[null,"BOBINGEN","BOBINGEN",772125,7304,"",null,"KIRCHHASLACH"]
[null,"BOBINGEN","KREUZANGER",772125,7305,"",null,"KIRCHHEIM"]
[null,"BOBINGEN","WALDBERG",772125,7306,"",null,"KIRCHHEIM B.MÜNCHEN"]
[null,"BOBINGEN","REINHARTSHAUSEN",772125,7307,"",null,"KIRCHHEIM I.SCHW."]
[null,"BOBINGEN","STRAßBERG",772125,7308,"",null,"KIRCHLAUTER"]
[null,"BOBINGEN","WEHRINGEN",772125,7322,"",null,"KIRCHROTH"]
[null,"BÖBRACH","BÖBRACH",276118,5725,"",null,"KIRCHSEEON"]
[null,"BOCKHORN","BOCKHORN",177113,8373,"",null,"KIRCHWEIDACH"]
[null,"BOCKHORN","GRÜNBACH",177113,8374,"",null,"KIRCHZELL"]
[null,"BOCKHORN","ESCHLBACH",177113,8375,"",null,"KISSING"]
[null,"BOCKHORN","SALMANNSKIRCHEN",177113,8381,"",null,"KIST"]
[null,"BOCKHORN","MATZBACH",177113,8382,"",null,"KITZINGEN"]
[null,"BODENKIRCHEN","WOLFERDING",274120,6664,"",null,"KLAUSWALD-SÜD"]
[null,"BODENKIRCHEN","AICH",274120,6665,"",null,"KLEINAITINGEN"]
[null,"BODENKIRCHEN","BINABIBURG",274120,6666,"",null,"KLEINHEUBACH"]
[null,"BODENKIRCHEN","ROTHENWÖRTH",274120,6667,"",null,"KLEINKAHL"]
[null,"BODENKIRCHEN","BONBRUCK",274120,6668,"",null,"KLEINLANGHEIM"]
[null,"BODENKIRCHEN","BODENKIRCHEN",274120,6669,"",null,"KLEINOSTHEIM"]
[null,"BODENKIRCHEN","HAUNZENBERGERSÖLL",274120,6670,"",null,"KLEINRINDERFELD"]
[null,"BODENKIRCHEN","WURMSHAM",274120,6678,"",null,"KLEINSENDELBACH"]
[null,"BODENMAIS","BODENMAIS",276117,5710,"",null,"KLEINWALLSTADT"]
[null,"BODENWÖHR","BODENWÖHR",376116,4928,"",null,"KLINGENBERG A.MAIN"]
[null,"BODENWÖHR","BODENWÖHRER FORST",376116,4929,"",null,"KLINGENBRUNNER WALD"]
[null,"BODENWÖHR","ERZHÄUSER",376116,4930,"",null,"KLOSTERLECHFELD"]
[null,"BODENWÖHR","TAXÖLDERN",376116,4931,"",null,"KNETZGAU"]
[null,"BODENWÖHR","ALTENSCHWAND",376116,4932,"",null,"KOCHEL A.SEE"]
[null,"BODENWÖHR","EGELSRIED",376116,4935,"",null,"KÖDITZ"]
[null,"BODENWÖHRER FORST","BODENWÖHRER FORST",376451,4929,"",null,"KÖDNITZ"]
[null,"BODOLZ","BODOLZ",776111,7934,"",null,"KÖFERING"]
[null,"BOGEN","AGENDORF",278118,5596,"",null,"KOHLBERG"]
[null,"BOGEN","OBERALTEICH",278118,5608,"",null,"KOLBERMOOR"]
[null,"BOGEN","BOGEN",278118,5614,"",null,"KOLITZHEIM"]
[null,"BOGEN","BOGENBERG",278118,5615,"",null,"KOLLENBERGER FORST"]
[null,"BOGEN","DEGERNBACH",278118,5616,"",null,"KOLLNBURG"]
[null,"BOGEN","PFELLING",278118,5628,"",null,"KÖLLNHOLZ"]
[null,"BÖHEN","BÖHEN",778119,7588,"",null,"KÖNIGSBERG I.BAYERN"]
[null,"BÖHMFELD","BÖHMFELD",176116,4042,"",null,"KÖNIGSBRUNN"]
[null,"BOLSTERLANG","BOLSTERLANG",780116,7984,"",null,"KÖNIGSDORF"]
[null,"BONSTETTEN","BONSTETTEN",772126,7224,"",null,"KÖNIGSFELD"]
[null,"BOOS","BOOS",778120,7551,"",null,"KÖNIGSMOOS"]
[null,"BOOS","REICHAU",778120,7552,"",null,"KÖNIGSTEIN"]
[null,"BRAND (LKR. DON)","MÜNSTER",779451,6976,"",null,"KONNERSREUTH"]
[null,"BRAND (LKR. TIR)","BRAND",377113,4201,"",null,"KONRADSREUTH"]
[null,"BRANNENBURG","BRANNENBURG",187120,9607,"",null,"KONZELL"]
[null,"BRANNENBURG","DEGERNDORF A.INN",187120,9611,"",null,"KOPPENWINDER FORST"]
[null,"BRANNENBURG","GROßBRANNENBERG",187120,9623,"",null,"KÖSCHING"]
[null,"BREITBRUNN","BREITBRUNN",674118,946,"",null,"KÖßLARN"]
[null,"BREITBRUNN","HERMANNSBERG",674118,947,"",null,"KOTTGEISERING"]
[null,"BREITBRUNN","LUßBERG",674118,948,"",null,"KÖTZ"]
[null,"BREITBRUNN A.CHIEMSE","BREITBRUNN A.CHIEMSEE",187121,9608,"",null,"KÖTZTING"]
[null,"BREITENBERG","GEGENBACH",275118,6320,"",null,"KRAFTISRIED"]
[null,"BREITENBERG","BREITENBERG",275118,6321,"",null,"KRAFTSHOFER FORST"]
[null,"BREITENBERG","SCHÖNBERG",275118,6322,"",null,"KRAIBURG A.INN"]
[null,"BREITENBERG","GOLLNERBERG",275118,6323,"",null,"KRAILLING"]
[null,"BREITENBRUNN (LKR. MN)","LOPPENHAUSEN",778121,7753,"",null,"KRANZBERG"]
[null,"BREITENBRUNN (LKR. MN)","BREITENBRUNN",778121,7754,"",null,"KRAUSENBACHER FORST"]
[null,"BREITENBRUNN (LKR. MN)","BEDERNAU",778121,7755,"",null,"KREUTH"]
[null,"BREITENBRUNN (LKR. NM)","GIMPERTSHAUSEN",373115,5421,{"$f":"+IF(A1026<>\"\",1,\"\")","v":""},null,"KREUTHER FORST"]
[null,"BREITENBRUNN (LKR. NM)","DÜRN",373115,5422,"",null,"KREUZWERTHEIM"]
[null,"BREITENBRUNN (LKR. NM)","KEMNATHEN",373115,5423,"",null,"KROMBACH"]
[null,"BREITENBRUNN (LKR. NM)","BUCH",373115,5424,"",null,"KRONACH"]
[null,"BREITENBRUNN (LKR. NM)","HAMBERG",373115,5425,"",null,"KRONBURG"]
[null,"BREITENBRUNN (LKR. NM)","LANGENTHONHAUSEN",373115,5426,"",null,"KRÖNING"]
[null,"BREITENBRUNN (LKR. NM)","BREITENBRUNN",373115,5427,"",null,"KRUMBACH I.SCHWABEN"]
[null,"BREITENBRUNN (LKR. NM)","PREMERZHOFEN",373115,5428,"",null,"KRUMMENNAAB"]
[null,"BREITENBRUNN (LKR. NM)","ERGGERTSHOFEN",373115,5429,"",null,"KRÜN"]
[null,"BREITENGÜßBACH","BREITENGÜßBACH",471119,2119,"",null,"KÜHBACH"]
[null,"BREITENGÜßBACH","HOHENGÜßBACH",471119,2194,"",null,"KÜHLENTHAL"]
[null,"BREITENGÜßBACH","UNTEROBERNDORF",471119,2320,"",null,"KULMAIN"]
[null,"BREITENGÜßBACH","ZÜCKSHUT",471119,2349,"",null,"KULMBACH"]
[null,"BREITENGÜßBACHER FORST","BREITENGÜßBACHER FORST",478451,1319,"",null,"KUMHAUSEN"]
[null,"BREITENTHAL","BREITENTHAL",774117,7707,"",null,"KÜMMERSBRUCK"]
[null,"BREITENTHAL","NATTENHAUSEN",774117,7708,"",null,"KUNREUTH"]
[null,"BRENNBERG","BRENNBERG",375120,5212,"",null,"KÜNZING"]
[null,"BRENNBERG","BRUCKBACH",375120,5213,"",null,"KUPFERBERG"]
[null,"BRENNBERG","DIETERSWEG",375120,5222,"",null,"KÜPS"]
[null,"BRENNBERG","FORSTMÜHLER FORST",375120,5231,"",null,"KÜRNACH"]
[null,"BRENNBERG","FRANKENBERG",375120,5232,"",null,"KUTZENHAUSEN"]
[null,"BRENNBERG","FRAUENZELL",375120,5233,"",null,"LAABER"]
[null,"BRUCK","BRUCK",175114,8754,"",null,"LABERWEINTING"]
[null,"BRUCK I.D.OPF.","BODENWÖHRER FORST",376117,4929,"",null,"LACHEN"]
[null,"BRUCK I.D.OPF.","BRUCK I.D.OPF.",376117,4938,"",null,"LALLING"]
[null,"BRUCK I.D.OPF.","MAPPACH",376117,4939,"",null,"LAM"]
[null,"BRUCK I.D.OPF.","MÖGENDORF",376117,4940,"",null,"LAMERDINGEN"]
[null,"BRUCK I.D.OPF.","SCHÖNGRAS",376117,4941,"",null,"LANDAU A.D.ISAR"]
[null,"BRUCK I.D.OPF.","VORDERTHÜRN",376117,4942,"",null,"LANDENSBERG"]
[null,"BRUCK I.D.OPF.","SOLLBACH",376117,4943,"",null,"LANDSBERG A.LECH"]
[null,"BRUCKBERG (LKR. AN)","BRUCKBERG",571122,3119,"",null,"LANDSBERIED"]
[null,"BRUCKBERG (LKR. LA)","WIDDERSDORF",274194,6607,"",null,"LANDSHUT"]
[null,"BRUCKBERG (LKR. LA)","ATTENHAUSEN",274194,6608,"",null,"LANGDORF"]
[null,"BRUCKBERG (LKR. LA)","TONDORF",274194,6609,"",null,"LANGENALTHEIM"]
[null,"BRUCKBERG (LKR. LA)","GÜNDLKOFEN",274194,6610,"",null,"LANGENBACH"]
[null,"BRUCKBERG (LKR. LA)","BRUCKBERG",274194,6611,"",null,"LANGENBACHER FORST"]
[null,"BRUCKBERG (LKR. LA)","BRUCKBERGERAU",274194,6612,"",null,"LANGENFELD"]
[null,"BRUCKMÜHL","BRUCKMÜHL",187122,9609,"",null,"LANGENMOSEN"]
[null,"BRUCKMÜHL","GÖTTING",187122,9620,"",null,"LANGENNEUFNACH"]
[null,"BRUCKMÜHL","HOLZHAM",187122,9641,"",null,"LANGENPREISING"]
[null,"BRUCKMÜHL","MADAU",187122,9647,"",null,"LANGENPROZELTENER FORST"]
[null,"BRUNN (LKR. R)","BRUNN",375122,5474,"",null,"LANGENSENDELBACH"]
[null,"BRUNN (LKR. RH)","BRUNN",574452,3406,"",null,"LANGENZENN"]
[null,"BRUNNEN","BRUNNEN",185123,8106,"",null,"LANGERRINGEN"]
[null,"BRUNNEN","HOHENRIED",185123,8107,"",null,"LANGFURTH"]
[null,"BRUNNTHAL","BRUNNTHAL",184114,8665,"",null,"LANGQUAID"]
[null,"BRUNNTHAL","HOFOLDING",184114,8680,"",null,"LANGWEID A.LECH"]
[null,"BUBENREUTH","BUBENREUTH",572119,2761,"",null,"LANGWEILER WALD"]
[null,"BUBESHEIM","BUBESHEIM",774118,7142,"",null,"LAPPERSDORF"]
[null,"BUCH","GANNERTSHOFEN",775118,7513,"",null,"LAUBEN"]
[null,"BUCH","DIETERSHOFEN B.ILLERTISSEN",775118,7514,"",null,"LAUDENBACH"]
[null,"BUCH","OBENHAUSEN",775118,7515,"",null,"LAUF A.D.PEGNITZ"]
[null,"BUCH","NORDHOLZ",775118,7516,"",null,"LAUFACH"]
[null,"BUCH","RENNERTSHOFEN",775118,7517,"",null,"LAUFAMHOLZER FORST"]
[null,"BUCH","BUCH",775118,7518,"",null,"LAUFEN"]
[null,"BUCH","RITZISRIED",775118,7519,"",null,"LAUGNA"]
[null,"BUCH","CHRISTERTSHOFEN",775118,7520,"",null,"LAUINGEN A.D.DONAU"]
[null,"BUCH A.BUCHRAIN","BUCH A.BUCHRAIN",177114,8400,"",null,"LAUTER"]
[null,"BUCH A.ERLBACH","BUCH A.ERLBACH",274121,6640,"",null,"LAUTERHOFEN"]
[null,"BUCH A.ERLBACH","GARNZELL",274121,6641,"",null,"LAUTERTAL"]
[null,"BUCH A.ERLBACH","VILSHEIM",274121,6650,"",null,"LAUTRACH"]
[null,"BUCH A.WALD","BUCH A.WALD",571125,2917,"",null,"LECHBRUCK"]
[null,"BUCH A.WALD","GASTENFELDEN",571125,2951,"",null,"LEGAU"]
[null,"BUCH A.WALD","HAGENAU",571125,2963,"",null,"LEHRBERG"]
[null,"BUCHBACH","BUCHBACH",183114,8824,{"$f":"+IF(A1090<>\"\",1,\"\")","v":""},null,"LEIBLFING"]
[null,"BUCHBACH","FELIZENZELL",183114,8825,"",null,"LEIDERSBACH"]
[null,"BUCHBACH","WALKERSAICH",183114,8826,"",null,"LEINACH"]
[null,"BUCHBACH","RANOLDSBERG",183114,8827,"",null,"LEINBURG"]
[null,"BUCHBRUNN","BUCHBRUNN",675114,1167,"",null,"LEIPHEIM"]
[null,"BUCHDORF","BAIERFELD",779126,6922,"",null,"LENAUER FORST"]
[null,"BUCHDORF","BUCHDORF",779126,6923,"",null,"LENGDORF"]
[null,"BÜCHENBACH","AURAU",576117,3808,"",null,"LENGENWANG"]
[null,"BÜCHENBACH","BÜCHENBACH",576117,3815,"",null,"LENGGRIES"]
[null,"BÜCHENBACH","GÜNZERSREUTH",576117,3834,"",null,"LENTING"]
[null,"BÜCHENBACH","OTTERSDORF",576117,3875,"",null,"LEONBERG"]
[null,"BUCHENBERG","KREUZTHAL",780117,7666,"",null,"LEOPOLDSREUTER WALD"]
[null,"BUCHENBERG","KÜRNACHER U.BUCHENBERGER WALD",780117,7667,"",null,"LEUCHTENBERG"]
[null,"BUCHENBERG","BUCHENBERG",780117,7668,"",null,"LEUPOLDSGRÜN"]
[null,"BUCHHOFEN","OTTMARING",271118,5938,"",null,"LEUTENBACH"]
[null,"BUCHHOFEN","BUCHHOFEN",271118,5939,"",null,"LEUTERSHAUSEN"]
[null,"BÜCHLBERG","LEOPRECHTING",275119,6308,"",null,"LICHTENAU"]
[null,"BÜCHLBERG","NIRSCHING",275119,6309,"",null,"LICHTENBERG"]
[null,"BÜCHLBERG","RAßBERG",275119,6310,"",null,"LICHTENFELS"]
[null,"BÜCHLBERG","DONAUWETZDORF",275119,6330,"",null,"LINDACH"]
[null,"BUCHLOE","BUCHLOE",777121,7825,"",null,"LINDAU (BODENSEE)"]
[null,"BUCHLOE","LINDENBERG",777121,7826,"",null,"LINDBERG"]
[null,"BUCHLOE","HONSOLGEN",777121,7827,"",null,"LINDENBERG I.ALLGÄU"]
[null,"BUCKENHOF","BUCKENHOF",572120,2763,"",null,"LINDENHARDTER FORST-NORDWEST"]
[null,"BUCKENHOFER FORST","BUCKENHOFER FORST",572452,2764,"",null,"LINDENHARDTER FORST-SÜDOST"]
[null,"BUNDORF","BUNDORF",674120,802,"",null,"LISBERG"]
[null,"BUNDORF","KIMMELSBACH",674120,806,"",null,"LITZENDORF"]
[null,"BUNDORF","NEUSES",674120,807,"",null,"LOHBERG"]
[null,"BUNDORF","ROTTENSTEINER FORST",674120,811,"",null,"LOHKIRCHEN"]
[null,"BUNDORF","STÖCKACH",674120,812,"",null,"LÖHLITZER WALD"]
[null,"BUNDORF","SCHWEINSHAUPTEN",674120,813,"",null,"LOHR A.MAIN"]
[null,"BUNDORF","WALCHENFELD",674120,823,"",null,"LOICHING"]
[null,"BUNDORFER FORST","BUNDORFER FORST",673451,123,"",null,"LOITZENDORF"]
[null,"BURGAU","LIMBACH",774121,7146,"",null,"LONNERSTADT"]
[null,"BURGAU","GROßANHAUSEN",774121,7147,"",null,"LUDWIGSCHORGAST"]
[null,"BURGAU","BURGAU",774121,7148,"",null,"LUDWIGSSTADT"]
[null,"BURGAU","GALGENFORST",774121,7162,"",null,"LUHE-WILDENAU"]
[null,"BURGBERG I.ALLGÄU","BURGBERG I.ALLGÄU",780118,7978,"",null,"LÜLSFELD"]
[null,"BURGBERNHEIM","BUCHHEIM",575115,2918,"",null,"LUPBURG"]
[null,"BURGBERNHEIM","BURGBERNHEIM",575115,2920,"",null,"LUßBERGER FORST"]
[null,"BURGBERNHEIM","PFAFFENHOFEN",575115,3019,"",null,"LUTZINGEN"]
[null,"BURGBERNHEIM","SCHWEBHEIM",575115,3030,"",null,"MÄHRING"]
[null,"BURGEBRACH","AMPFERBACH",471120,2106,"",null,"MAIERHÖFEN"]
[null,"BURGEBRACH","BURGEBRACH",471120,2125,"",null,"MAIHINGEN"]
[null,"BURGEBRACH","BURGWINDHEIM",471120,2130,"",null,"MAINASCHAFF"]
[null,"BURGEBRACH","GRASMANNSDORF",471120,2169,"",null,"MAINBERNHEIM"]
[null,"BURGEBRACH","MÖNCHHERRNSDORF",471120,2231,"",null,"MAINBURG"]
[null,"BURGEBRACH","MÖNCHSAMBACH",471120,2232,"",null,"MAINECKER FORST"]
[null,"BURGEBRACH","OBERHARNSBACH",471120,2242,"",null,"MAINLEUS"]
[null,"BURGEBRACH","OBERKÖST",471120,2243,"",null,"MAINSTOCKHEIM"]
[null,"BURGEBRACH","STAPPENBACH",471120,2292,"",null,"MAISACH"]
[null,"BURGEBRACH","TREPPENDORF",471120,2310,"",null,"MAITENBETH"]
[null,"BURGEBRACH","UNTERNEUSES",471120,2319,"",null,"MALCHING"]
[null,"BURGEBRACH","VOLLMANNSDORF",471120,2327,"",null,"MALGERSDORF"]
[null,"BÜRGERWALD","GEROLZHOFEN",678451,1036,"",null,"MALLERSDORF-PFAFFENB"]
[null,"BURGGEN","BURGGEN",190118,9086,"",null,"MAMMENDORF"]
[null,"BURGGEN","TANNENBERG",190118,9101,"",null,"MAMMING"]
[null,"BURGHASLACH","BURGHÖCHSTADT",575116,1177,"",null,"MANCHING"]
[null,"BURGHASLACH","FREIHASLACH",575116,1178,"",null,"MANTEL"]
[null,"BURGHASLACH","FÜRSTENFORST",575116,1179,"",null,"MANTELER FORST"]
[null,"BURGHASLACH","OBERRIMBACH",575116,1196,"",null,"MARGETSHÖCHHEIM"]
[null,"BURGHASLACH","SEITENBUCH",575116,1197,"",null,"MARIAPOSCHING"]
[null,"BURGHASLACH","MARKT TASCHENDORF",575116,1198,"",null,"MARK"]
[null,"BURGHASLACH","BURGHASLACH",575116,1199,"",null,"MARKERTSGRÜNER FORST-OST"]
[null,"BURGHASLACH","BREITENLOHE",575116,1200,{"$f":"+IF(A1154<>\"\",1,\"\")","v":""},null,"MARKERTSGRÜNER FORST-WEST"]
[null,"BURGHASLACH","NIEDERNDORF",575116,1201,"",null,"MARKLKOFEN"]
[null,"BURGHASLACH","GLEIßENBERG",575116,1202,"",null,"MARKT BEROLZHEIM"]
[null,"BURGHAUSEN","BURGHAUSEN",171112,8904,"",null,"MARKT BIBART"]
[null,"BURGHAUSEN","RAITENHASLACH",171112,8932,"",null,"MARKT EINERSHEIM"]
[null,"BURGHAUSEN","HOLZFELDER FORST",171112,8949,"",null,"MARKT ERLBACH"]
[null,"BURGHEIM","MOOS",185125,7019,"",null,"MARKT INDERSDORF"]
[null,"BURGHEIM","STRAß",185125,7020,"",null,"MARKT NORDHEIM"]
[null,"BURGHEIM","BURGHEIM",185125,7021,"",null,"MARKT RETTENBACH"]
[null,"BURGHEIM","ORTLFING",185125,7022,"",null,"MARKT SCHWABEN"]
[null,"BURGHEIM","LEIDLING",185125,7023,"",null,"MARKT TASCHENDORF"]
[null,"BURGHEIM","KUNDING",185125,7024,"",null,"MARKT WALD"]
[null,"BURGHEIM","ILLDORF",185125,7025,"",null,"MARKTBERGEL"]
[null,"BURGHEIM","DEZENACKER",185125,7026,"",null,"MARKTBREIT"]
[null,"BURGHEIM","WENGEN",185125,7027,"",null,"MARKTGRAITZ"]
[null,"BURGJOß","BURGJOß",677452,501,"",null,"MARKTHEIDENFELD"]
[null,"BURGKIRCHEN A.D.ALZ","BURGKIRCHEN A.D.ALZ",171113,8905,"",null,"MARKTL"]
[null,"BURGKIRCHEN A.D.ALZ","DORFEN",171113,8906,"",null,"MARKTLEUGAST"]
[null,"BURGKIRCHEN A.D.ALZ","FORSTKASTL",171113,8912,"",null,"MARKTLEUTHEN"]
[null,"BURGKIRCHEN A.D.ALZ","GUFFLHAM",171113,8914,"",null,"MARKTOBERDORF"]
[null,"BURGKIRCHEN A.D.ALZ","NEUKIRCHEN A.D.ALZ",171113,8922,"",null,"MARKTOFFINGEN"]
[null,"BURGKIRCHEN A.D.ALZ","RAITENHASLACH",171113,8932,"",null,"MARKTREDWITZ"]
[null,"BURGKIRCHEN A.D.ALZ","ALTÖTTINGER FORST",171113,8946,"",null,"MARKTRODACH"]
[null,"BURGKUNSTADT","EBNETH",478116,1808,"",null,"MARKTSCHELLENBERG"]
[null,"BURGKUNSTADT","KIRCHLEIN",478116,1809,"",null,"MARKTSCHORGAST"]
[null,"BURGKUNSTADT","GÄRTENROTH",478116,1810,"",null,"MARKTSTEFT"]
[null,"BURGKUNSTADT","NEUSES A.MAIN",478116,1811,"",null,"MARKTZEULN"]
[null,"BURGKUNSTADT","WEIDNITZ",478116,1812,"",null,"MARLOFFSTEIN"]
[null,"BURGKUNSTADT","BURGKUNSTADT",478116,1813,"",null,"MAROLDSWEISACH"]
[null,"BURGKUNSTADT","THEISAU",478116,1814,"",null,"MARQUARTSTEIN"]
[null,"BURGKUNSTADT","MAINROTH",478116,1815,"",null,"MARTINLAMITZER FORST-NORD"]
[null,"BURGLAUER","BURGLAUER WALD",673186,109,"",null,"MARTINLAMITZER FORST-SÜD"]
[null,"BURGLAUER","BURGLAUER",673186,110,"",null,"MARTINSHEIM"]
[null,"BURGLAUER","Steinacher Forst l.d.Saale",673186,192,"",null,"MARXHEIM"]
[null,"BURGLENGENFELD","BÜCHHEIM",376119,4763,"",null,"MARZLING"]
[null,"BURGLENGENFELD","PILSHEIM",376119,4766,"",null,"MAßBACH"]
[null,"BURGLENGENFELD","HÖCHENSEE",376119,4771,"",null,"MASSING"]
[null,"BURGLENGENFELD","HACKELBERG",376119,4772,"",null,"MAUERN"]
[null,"BURGLENGENFELD","LANZENRIED",376119,4775,"",null,"MAUERSTETTEN"]
[null,"BURGLENGENFELD","POTTENSTETTEN",376119,4776,"",null,"MAUTH"]
[null,"BURGLENGENFELD","DIETLDORF",376119,4781,"",null,"MAUTHER FORST"]
[null,"BURGLENGENFELD","BURGLENGENFELDER FORST",376119,4782,"",null,"MAXHÜTTE-HAIDHOF"]
[null,"BURGLENGENFELD","BURGLENGENFELD",376119,4783,"",null,"MEDLINGEN"]
[null,"BURGLENGENFELD","SEE",376119,4785,"",null,"MEEDER"]
[null,"BURGOBERBACH","BURGOBERBACH",571127,3125,"",null,"MEGESHEIM"]
[null,"BURGOBERBACH","DIERERSDORF",571127,3128,"",null,"MEHLMEISEL"]
[null,"BURGOBERBACH","NEUSES",571127,3196,"",null,"MEHRING"]
[null,"BURGOBERBACH","NIEDEROBERBACH",571127,3199,"",null,"MEIERHÖFER SEITE"]
[null,"BURGOBERBACH","SOMMERSDORF",571127,3221,"",null,"MEINHEIM"]
[null,"BURGPREPPACH","UESCHERSDORF",674121,827,"",null,"MEITINGEN"]
[null,"BURGPREPPACH","BIRKACH",674121,828,"",null,"MELLRICHSTADT"]
[null,"BURGPREPPACH","GEMEINFELD",674121,829,"",null,"MELLRICHSTADTER FORST"]
[null,"BURGPREPPACH","FITZENDORF",674121,839,"",null,"MEMMELSDORF"]
[null,"BURGPREPPACH","IBIND",674121,840,"",null,"MEMMINGEN"]
[null,"BURGPREPPACH","BURGPREPPACH",674121,841,"",null,"MEMMINGERBERG"]
[null,"BURGPREPPACH","LEUZENDORF I.UFR.",674121,842,"",null,"MENGKOFEN"]
[null,"BURGPREPPACH","HOHNHAUSEN",674121,852,"",null,"MERCHING"]
[null,"BURGPREPPACH","GOßMANNSDORFER FORST",674121,853,"",null,"MERING"]
[null,"BURGSALACH","INDERNBUCH",577120,3723,"",null,"MERKENDORF"]
[null,"BURGSALACH","PFRAUNFELD",577120,3724,"",null,"MERTINGEN"]
[null,"BURGSALACH","BURGSALACH",577120,3725,"",null,"MESPELBRUNN"]
[null,"BURGSINN","Burgsinn",677122,507,"",null,"METTEN"]
[null,"BÜRGSTADT","BÜRGSTADT",676116,452,"",null,"METTENHEIM"]
[null,"BURGTHANN","BURGTHANN",574117,3408,"",null,"MICHELAU I.OFR."]
[null,"BURGTHANN","DÖRLBACH",574117,3410,{"$f":"+IF(A1218<>\"\",1,\"\")","v":""},null,"MICHELAU I.STEIGERWA"]
[null,"BURGTHANN","EZELSDORF",574117,3416,"",null,"MICHELRIETHER FORST"]
[null,"BURGTHANN","GRUB",574117,3429,"",null,"MICHELSNEUKIRCHEN"]
[null,"BURGTHANN","OBERFERRIEDEN",574117,3451,"",null,"MICHLBACH"]
[null,"BURGTHANN","SCHWARZENBACH",574117,3466,"",null,"MICKHAUSEN"]
[null,"BURGTHANN","UNTERFERRIEDEN",574117,3473,"",null,"MIESBACH"]
[null,"BURGWALLBACHER FORST","BURGWALLBACHER FORST",673452,60,"",null,"MILTACH"]
[null,"BURGWINDHEIM","BURGWINDHEIM",471122,2130,"",null,"MILTENBERG"]
[null,"BURGWINDHEIM","KÖTSCH",471122,2204,"",null,"MINDELHEIM"]
[null,"BURGWINDHEIM","UNTERSTEINACH",471122,2322,"",null,"MINDELSTETTEN"]
[null,"BURGWINDHEIM","UNTERWEILER",471122,2323,"",null,"MINTRACHING"]
[null,"BURK","BURK",571128,2921,"",null,"MISSEN-WILHAMS"]
[null,"BURK","MEIERNDORF",571128,2996,"",null,"MISTELBACH"]
[null,"BURKARDROTH","SALZFORST",672117,170,"",null,"MISTELGAU"]
[null,"BURKARDROTH","GEFÄLL",672117,171,"",null,"MITTELESCHENBACH"]
[null,"BURKARDROTH","PREMICH",672117,172,"",null,"MITTELNEUFNACH"]
[null,"BURKARDROTH","STANGENROTH",672117,178,"",null,"MITTELSINN"]
[null,"BURKARDROTH","BURKARDROTH",672117,188,"",null,"MITTELSTETTEN"]
[null,"BURKARDROTH","WOLLBACH",672117,189,"",null,"MITTENWALD"]
[null,"BURKARDROTH","Waldfensterer Forst",672117,199,"",null,"MITTERBERG"]
[null,"BURKARDROTH","WALDFENSTER",672117,200,"",null,"MITTERFELS"]
[null,"BURKARDROTH","Zahlbach",672117,201,"",null,"MITTERSKIRCHEN"]
[null,"BURKARDROTH","FRAUENROTH",672117,202,"",null,"MITTERTEICH"]
[null,"BURKARDROTH","OEHRBERG",672117,211,"",null,"MITWITZ"]
[null,"BURKARDROTH","LAUTER",672117,215,"",null,"MÖDINGEN"]
[null,"BURKARDROTH","KATZENBACH",672117,220,"",null,"MÖHRENDORF"]
[null,"BURKARDROTH","STRALSBACH",672117,221,"",null,"MÖMBRIS"]
[null,"BURTENBACH","OBERWALDBACH",774122,7176,"",null,"MÖMLINGEN"]
[null,"BURTENBACH","KEMNAT",774122,7177,"",null,"MÖNCHBERG"]
[null,"BURTENBACH","BURTENBACH",774122,7178,"",null,"MÖNCHSDEGGINGEN"]
[null,"BUTTENHEIM","BUTTENHEIM",471123,2132,"",null,"MÖNCHSROTH"]
[null,"BUTTENHEIM","DREUSCHENDORF",471123,2142,"",null,"MONHEIM"]
[null,"BUTTENHEIM","FRANKENDORF",471123,2159,"",null,"MOORENWEIS"]
[null,"BUTTENHEIM","GUNZENDORF",471123,2176,"",null,"MOOS"]
[null,"BUTTENHEIM","KETSCHENDORF",471123,2201,"",null,"MOOSACH"]
[null,"BUTTENHEIM","STACKENDORF",471123,2289,"",null,"MOOSBACH"]
[null,"BUTTENHEIM","TIEFENHÖCHSTADT",471123,2305,"",null,"MOOSBURG A.D.ISAR"]
[null,"BUTTENWIESEN","PFAFFENHOFEN A.D.ZUSAM",773122,6867,"",null,"MOOSINNING"]
[null,"BUTTENWIESEN","LAUTERBACH",773122,6868,"",null,"MOOSTHENNING"]
[null,"BUTTENWIESEN","UNTERTHÜRHEIM",773122,6869,"",null,"MÖRNSHEIM"]
[null,"BUTTENWIESEN","OBERTHÜRHEIM",773122,6870,"",null,"MOTTEN"]
[null,"BUTTENWIESEN","BUTTENWIESEN",773122,6871,"",null,"MOTTENER FORST-SÜD"]
[null,"BUTTENWIESEN","WORTELSTETTEN",773122,6872,"",null,"MÖTTINGEN"]
[null,"BUTTENWIESEN","FRAUENSTETTEN",773122,6873,"",null,"MÖTZING"]
[null,"BÜTTHARD","GÜTZINGEN",679122,747,"",null,"MÜHLDORF A.INN"]
[null,"BÜTTHARD","BÜTTHARD",679122,753,"",null,"MÜHLDORFER HART"]
[null,"BÜTTHARD","HÖTTINGEN",679122,754,"",null,"MÜHLHAUSEN"]
[null,"BÜTTHARD","GAURETTERSHEIM",679122,758,"",null,"MUHR A.SEE"]
[null,"BÜTTHARD","OESFELD",679122,763,"",null,"MÜNCHBERG"]
[null,"BÜTTHARD","TIEFENTHAL",679122,764,"",null,"MÜNCHEN"]
[null,"BUXHEIM (LKR. EI)","TAUBERFELD",176118,4043,"",null,"MÜNCHSMÜNSTER"]
[null,"BUXHEIM (LKR. EI)","BUXHEIM",176118,4044,"",null,"MÜNCHSTEINACH"]
[null,"BUXHEIM (LKR. MN)","BUXHEIM",778123,7565,"",null,"MÜNNERSTADT"]
[null,"CADOLZBURG","HORBACH",573114,3328,"",null,"MUNNINGEN"]
[null,"CADOLZBURG","CADOLZBURG",573114,3345,"",null,"MÜNSING"]
[null,"CADOLZBURG","ROßENDORF",573114,3346,"",null,"MÜNSTER"]
[null,"CADOLZBURG","DEBERNDORF",573114,3347,"",null,"MÜNSTERHAUSEN"]
[null,"CADOLZBURG","STEINBACH",573114,3348,"",null,"MURNAU A.STAFFELSEE"]
[null,"CALLENBERGER FORST-WEST","CALLENBERGER FORST-WEST",473452,1326,"",null,"NABBURG"]
[null,"CASTELL","GREUTH",675116,1171,"",null,"NAGEL"]
[null,"CASTELL","CASTELL",675116,1172,"",null,"NAILA"]
[null,"CASTELL","WÜSTENFELDEN",675116,1189,"",null,"NANDLSTADT"]
[null,"CHAM","RHANWALTING",372116,5045,"",null,"NASSENFELS"]
[null,"CHAM","LOIBLING",372116,5086,"",null,"NENNSLINGEN"]
[null,"CHAM","KATZBERG",372116,5087,{"$f":"+IF(A1282<>\"\",1,\"\")","v":""},null,"NERSINGEN"]
[null,"CHAM","WINDISCHBERGERDORF",372116,5088,"",null,"NEUALBENREUTH"]
[null,"CHAM","CHAM",372116,5089,"",null,"NEUBAUER FORST-NORD"]
[null,"CHAM","THIERLSTEIN",372116,5090,"",null,"NEUBAUER FORST-SÜD"]
[null,"CHAM","ALTENMARKT",372116,5091,"",null,"NEUBEUERN"]
[null,"CHAM","CHAMEREGG",372116,5092,"",null,"NEUBIBERG"]
[null,"CHAM","CHAMMÜNSTER",372116,5093,"",null,"NEUBRUNN"]
[null,"CHAM","HOF",372116,5094,"",null,"NEUBURG A.D.DONAU"]
[null,"CHAM","GUTMANING",372116,5095,"",null,"NEUBURG A.D.KAMMEL"]
[null,"CHAM","HADERSTADL",372116,5096,"",null,"NEUBURG A.INN"]
[null,"CHAM","VILZING",372116,5097,"",null,"NEUCHING"]
[null,"CHAM","SCHACHENDORF",372116,5098,"",null,"NEUDROSSENFELD"]
[null,"CHAM","BERGWERK",372116,5176,"",null,"NEUENDETTELSAU"]
[null,"CHAMERAU","HADERSTADL",372117,5096,"",null,"NEUENDORF"]
[null,"CHAMERAU","CHAMERAU",372117,5102,"",null,"NEUENHAMMER"]
[null,"CHAMERAU","BÄRNDORF",372117,5103,"",null,"NEUENMARKT"]
[null,"CHAMERAU","LEDERDORN",372117,5104,"",null,"NEUENSORGER FORST"]
[null,"CHIEMING","ISING",189114,9823,"",null,"NEUFAHRN B.FREISING"]
[null,"CHIEMING","HART",189114,9824,"",null,"NEUFAHRN I.NB"]
[null,"CHIEMING","CHIEMING",189114,9825,"",null,"NEUFRAUNHOFEN"]
[null,"CHIEMING","OBERHOCHSTÄTT",189114,9846,"",null,"NEUHAUS A.D.PEGNITZ"]
[null,"CHIEMSEE (LKR. RO)","CHIEMSEE",187123,9610,"",null,"NEUHAUS A.INN"]
[null,"CHIEMSEE (LKR. TS)","CHIEMSEE (SEE)",189451,9842,"",null,"NEUHAUSER FORST"]
[null,"CHIEMSEE (LKR. TS)","CHIEMSEEMÖSER",189451,9843,"",null,"NEUHOF A.D.ZENN"]
[null,"COBURG","BEIERSDORF B.COBURG",463000,1307,"",null,"NEUHÜTTEN"]
[null,"COBURG","BERTELSDORF",463000,1308,"",null,"NEUKIRCHEN"]
[null,"COBURG","CALLENBERGER FORST-OST",463000,1325,"",null,"NEUKIRCHEN B.HL.BLUT"]
[null,"COBURG","COBURG",463000,1327,"",null,"NEUKIRCHEN B.SULZB.R"]
[null,"COBURG","COBURGER FORST-NORDWEST",463000,1328,"",null,"NEUKIRCHEN VORM WALD"]
[null,"COBURG","CORTENDORF",463000,1330,"",null,"NEUKIRCHEN-BALBINI"]
[null,"COBURG","CREIDLITZ",463000,1331,"",null,"NEUMARKT I.D.OPF."]
[null,"COBURG","KETSCHENDORF",463000,1385,"",null,"NEUMARKT-ST. VEIT"]
[null,"COBURG","LÜTZELBUCH",463000,1404,"",null,"NEUNBURG VORM WALD"]
[null,"COBURG","NEUSES B.COBURG",463000,1432,"",null,"NEUNHOFER FORST"]
[null,"COBURG","NEU- U.NEERSHOF",463000,1435,"",null,"NEUNKIRCHEN"]
[null,"COBURG","RÖGEN",463000,1456,"",null,"NEUNKIRCHEN A.BRAND"]
[null,"COBURG","SCHEUERFELD",463000,1470,"",null,"NEUNKIRCHEN A.SAND"]
[null,"COBURG","SEIDMANNSDORF",463000,1478,"",null,"NEUÖTTING"]
[null,"COBURG","WÜSTENAHORN",463000,1533,"",null,"NEUREICHENAU"]
[null,"COLLENBERG","FECHENBACH",676117,437,"",null,"NEURIED"]
[null,"COLLENBERG","REISTENHAUSEN",676117,448,"",null,"NEUSÄß"]
[null,"COLMBERG","AUERBACH",571130,3107,"",null,"NEUSCHÖNAU"]
[null,"COLMBERG","BINZWANGEN",571130,3115,"",null,"NEUSITZ"]
[null,"COLMBERG","COLMBERG",571130,3127,"",null,"NEUSORG"]
[null,"COLMBERG","FROMMETSFELDEN",571130,3141,"",null,"NEUSTADT A.D.AISCH"]
[null,"COLMBERG","OBERFELDEN",571130,3201,"",null,"NEUSTADT A.D.DONAU"]
[null,"COLMBERG","POPPENBACH",571130,3206,"",null,"NEUSTADT A.D.WALDNAA"]
[null,"CREUßEN","WOLFSBACH",472127,2439,"",null,"NEUSTADT A.KULM"]
[null,"CREUßEN","FORST THIERGARTEN",472127,2469,"",null,"NEUSTADT A.MAIN"]
[null,"CREUßEN","BODEN",472127,2488,"",null,"NEUSTADT B.COBURG"]
[null,"CREUßEN","SEIDWITZ",472127,2489,"",null,"NEUTRAUBLING"]
[null,"CREUßEN","CREUßEN",472127,2490,"",null,"NEU-ULM"]
[null,"CREUßEN","GOTTSFELD",472127,2491,"",null,"NEUWIRTSHAUSER FORST"]
[null,"CREUßEN","BÜHL",472127,2492,"",null,"NIEDERAICHBACH"]
[null,"CREUßEN","NEUHOF",472127,2493,"",null,"NIEDERALTEICH"]
[null,"CREUßEN","LINDENHARDT",472127,2494,"",null,"NIEDERBERGKIRCHEN"]
[null,"CREUßEN","STOCKMÜHLE",472127,2495,"",null,"NIEDERFÜLLBACH"]
[null,"CREUßEN","HAIDHOF",472127,2496,"",null,"NIEDERLAUER"]
[null,"CREUßENER HAGENREUTH","BODEN",472452,2488,"",null,"NIEDERMURACH"]
[null,"DACHAU","DACHAU",174115,8580,"",null,"NIEDERNBERG"]
[null,"DACHAU","ETZENHAUSEN",174115,8581,"",null,"NIEDERRIEDEN"]
[null,"DACHAU","GÜNDING",174115,8620,"",null,"NIEDERSCHÖNENFELD"]
[null,"DACHAU","PELLHEIM",174115,8636,"",null,"NIEDERTAUFKIRCHEN"]
[null,"DACHSBACH","DACHSBACH",575117,3273,"",null,"NIEDERVIEHBACH"]
[null,"DACHSBACH","RAUSCHENBERG",575117,3274,{"$f":"+IF(A1346<>\"\",1,\"\")","v":""},null,"NIEDERWERRN"]
[null,"DACHSBACH","OBERHÖCHSTÄDT",575117,3275,"",null,"NIEDERWINKLING"]
[null,"DACHSBACH","TRAISHÖCHSTÄDT",575117,3276,"",null,"NITTENAU"]
[null,"DAITING","NATTERHOLZ",779129,6919,"",null,"NITTENDORF"]
[null,"DAITING","HOCHFELD",779129,6920,"",null,"NONNENHORN"]
[null,"DAITING","DAITING",779129,6921,"",null,"NONNENKLOSTER"]
[null,"DAMMBACH","WINTERSBACH",671160,391,"",null,"NORDENDORF"]
[null,"DAMMBACH","KRAUSENBACH",671160,392,"",null,"NORDHALBEN"]
[null,"DAMMBACH","Krausenbacher Forst",671160,393,"",null,"NORDHEIM A.MAIN"]
[null,"DASCHENDORFER FORST","DASCHENDORFER FORST",471451,2134,"",null,"NORDHEIM V.D.RHÖN"]
[null,"DASING","TAITING",771122,7355,"",null,"NÖRDL.STEINWALD"]
[null,"DASING","LAIMERING",771122,7356,"",null,"NÖRDLINGEN"]
[null,"DASING","RIEDEN",771122,7357,"",null,"NÜDLINGEN"]
[null,"DASING","DASING",771122,7358,"",null,"NÜRNBERG"]
[null,"DASING","WESSISZELL",771122,7359,"",null,"NUßDORF"]
[null,"DASING","BURGADELZHAUSEN",771122,7362,"",null,"NUßDORF A.INN"]
[null,"DASING","HABERSKIRCH",771122,7369,"",null,"OBER- U.UNTERWALD"]
[null,"DASING","HARTHAUSEN",771122,7374,"",null,"OBERAMMERGAU"]
[null,"DASING","ZIEGLBACH",771122,7378,"",null,"OBERASBACH"]
[null,"DECHENWALD","PRÜNST",576452,3881,"",null,"OBERAU"]
[null,"DEGGENDORF","NATTERNBERG",271119,5912,"",null,"OBERAUDORF"]
[null,"DEGGENDORF","FISCHERDORF",271119,5913,"",null,"OBERAURACH"]
[null,"DEGGENDORF","SCHACHING",271119,5914,"",null,"OBERBERGKIRCHEN"]
[null,"DEGGENDORF","DEGGENDORF",271119,5915,"",null,"OBERDACHSTETTEN"]
[null,"DEGGENDORF","MIETRACHING",271119,5916,"",null,"OBERDING"]
[null,"DEGGENDORF","GREISING",271119,5917,"",null,"OBERDOLLING"]
[null,"DEGGENDORF","DEGGENAU",271119,5918,"",null,"OBERELSBACH"]
[null,"DEGGENDORF","SEEBACH",271119,5919,"",null,"OBERGRIESBACH"]
[null,"DEINING","DEINING",373119,4610,"",null,"OBERGÜNZBURG"]
[null,"DEINING","DÖLLWANG",373119,4614,"",null,"OBERHACHING"]
[null,"DEINING","GROßALFALTERBACH",373119,4625,"",null,"OBERHAID"]
[null,"DEINING","LEUTENBACH",373119,4643,"",null,"OBERHAUSEN"]
[null,"DEINING","MITTERSTHAL",373119,4650,"",null,"OBERICKELSHEIM"]
[null,"DEINING","OBERBUCHFELD",373119,4656,"",null,"OBERKOTZAU"]
[null,"DEINING","UNTERBUCHFELD",373119,4698,"",null,"OBERLEICHTERSBACH"]
[null,"DEINING","WALTERSBERG",373119,4701,"",null,"OBERMAISELSTEIN"]
[null,"DEININGEN","DEININGEN",779130,6747,"",null,"OBERMEITINGEN"]
[null,"DEISENHAUSEN","UNTERBLEICHEN",774124,7704,"",null,"OBERMICHELBACH"]
[null,"DEISENHAUSEN","OBERBLEICHEN",774124,7705,"",null,"OBERNBREIT"]
[null,"DEISENHAUSEN","DEISENHAUSEN",774124,7706,"",null,"OBERNBURG A.MAIN"]
[null,"DEISENHOFENER FORST","DEISENHOFENER FORST-NORD",184451,8716,"",null,"OBERNDORF A.LECH"]
[null,"DEISENHOFENER FORST","DEISENHOFENER FORST-SÜD",184451,8722,"",null,"OBERNEUKIRCHEN"]
[null,"DENKENDORF","GELBELSEE",176120,4025,"",null,"OBERNZELL"]
[null,"DENKENDORF","DÖRNDORF",176120,4026,"",null,"OBERNZENN"]
[null,"DENKENDORF","BITZ",176120,4027,"",null,"OBEROSTENDORF"]
[null,"DENKENDORF","DENKENDORF",176120,4028,"",null,"OBEROTTMARSHAUSEN"]
[null,"DENKENDORF","ALTENBERG",176120,4029,"",null,"OBERPFRAMMERN"]
[null,"DENKENDORF","ZANDT",176120,4030,"",null,"OBERPLEICHFELD"]
[null,"DENKENDORF","SCHÖNBRUNN",176120,4031,"",null,"OBERPÖRING"]
[null,"DENKLINGEN","DENKLINGEN",181113,9005,"",null,"OBERREICHENBACH"]
[null,"DENKLINGEN","DIENHAUSEN",181113,9008,"",null,"OBERREUTE"]
[null,"DENKLINGEN","EPFACH",181113,9015,"",null,"OBERRIEDEN"]
[null,"DENTLEIN A.FORST","AICHAU",571132,2903,"",null,"OBERROGGENBURGER WALD"]
[null,"DENTLEIN A.FORST","DENTLEIN A.FORST",571132,2926,"",null,"OBERROTH"]
[null,"DENTLEIN A.FORST","THÜRNHOFEN",571132,3044,"",null,"OBERSCHEINFELD"]
[null,"DETTELBACH","NEUSETZ",675117,1108,"",null,"OBERSCHLEIßHEIM"]
[null,"DETTELBACH","EUERFELD",675117,1119,"",null,"OBERSCHNEIDING"]
[null,"DETTELBACH","SCHERNAU",675117,1120,"",null,"OBERSCHÖNEGG"]
[null,"DETTELBACH","SCHNEPFENBACH",675117,1121,"",null,"OBERSCHWARZACH"]
[null,"DETTELBACH","BRÜCK",675117,1122,"",null,"OBERSCHWEINBACH"]
[null,"DETTELBACH","NEUSES A.BERG",675117,1123,"",null,"OBERSINN"]
[null,"DETTELBACH","EFFELDORF",675117,1133,"",null,"OBERSÖCHERING"]
[null,"DETTELBACH","BIBERGAU",675117,1134,"",null,"OBERSTAUFEN"]
[null,"DETTELBACH","DETTELBACH",675117,1135,"",null,"OBERSTDORF"]
[null,"DETTELBACH","MAINSONDHEIM",675117,1136,{"$f":"+IF(A1410<>\"\",1,\"\")","v":""},null,"OBERSTREU"]
[null,"DEUERLING","DEUERLING",375127,5475,"",null,"OBERSÜßBACH"]
[null,"DIEBACH","BELLERSHAUSEN",571134,2910,"",null,"OBERTAUFKIRCHEN"]
[null,"DIEBACH","DIEBACH",571134,2928,"",null,"OBERTHULBA"]
[null,"DIEBACH","OESTHEIM",571134,3015,"",null,"OBERTRAUBLING"]
[null,"DIEDORF","DIEDORF",772130,7279,"",null,"OBERTRUBACH"]
[null,"DIEDORF","BIBURG",772130,7280,"",null,"OBERVIECHTACH"]
[null,"DIEDORF","WILLISHAUSEN",772130,7281,"",null,"OBING"]
[null,"DIEDORF","ANHAUSEN",772130,7282,"",null,"OCHSENFURT"]
[null,"DIESPECK","DIESPECK",575118,3265,"",null,"ODELZHAUSEN"]
[null,"DIESPECK","STÜBACH",575118,3266,"",null,"OERLENBACH"]
[null,"DIESPECK","DETTENDORF",575118,3267,"",null,"OETTINGEN I.BAYERN"]
[null,"DIEßEN A.AMMERSEE","DETTENHOFEN",181114,9006,"",null,"OFFENBERG"]
[null,"DIEßEN A.AMMERSEE","DETTENSCHWANG",181114,9007,"",null,"OFFENHAUSEN"]
[null,"DIEßEN A.AMMERSEE","DIEßEN A.AMMERSEE",181114,9009,"",null,"OFFINGEN"]
[null,"DIEßEN A.AMMERSEE","OBERMÜHLHAUSEN",181114,9043,"",null,"OFTERSCHWANG"]
[null,"DIEßEN A.AMMERSEE","RIEDEN A.AMMERSEE",181114,9056,"",null,"OHLSTADT"]
[null,"DIEßEN A.AMMERSEE","SANKT GEORGEN",181114,9058,"",null,"OHRENBACH"]
[null,"DIEßEN A.AMMERSEE","BAYERDIEßEN",181114,9078,"",null,"OLCHING"]
[null,"DIETENHOFEN","DIETENHOFEN",571135,3129,"",null,"OMERZ U.ROTER BERG"]
[null,"DIETENHOFEN","EBERSDORF",571135,3130,"",null,"OPFENBACH"]
[null,"DIETENHOFEN","GÖTTELDORF",571135,3145,"",null,"ORNBAU"]
[null,"DIETENHOFEN","HAASGANG",571135,3152,"",null,"ORTENBURG"]
[null,"DIETENHOFEN","HERPERSDORF B.DIETENHOFEN",571135,3157,"",null,"OSING"]
[null,"DIETENHOFEN","KEHLMÜNZ",571135,3169,"",null,"OSTERBERG"]
[null,"DIETENHOFEN","KLEINHASLACH",571135,3173,"",null,"OSTERHOFEN"]
[null,"DIETENHOFEN","LEONROD",571135,3179,"",null,"OSTERZELL"]
[null,"DIETENHOFEN","NEUDORF",571135,3192,"",null,"OSTHEIM V.D.RHÖN"]
[null,"DIETENHOFEN","SEUBERSDORF",571135,3220,"",null,"ÖSTL.NEUBÄUER FORST"]
[null,"DIETENHOFEN","UNTERNBIBERT",571135,3227,"",null,"OTTENHOFEN"]
[null,"DIETERSBURG","BAUMGARTEN",277114,6404,"",null,"OTTENSOOS"]
[null,"DIETERSBURG","DIETERSBURG",277114,6406,"",null,"OTTERFING"]
[null,"DIETERSBURG","NÖHAM",277114,6446,"",null,"OTTING"]
[null,"DIETERSHEIM","ALTHEIM",575119,2905,"",null,"OTTOBEUREN"]
[null,"DIETERSHEIM","BEERBACH",575119,2909,"",null,"OTTOBRUNN"]
[null,"DIETERSHEIM","DIETERSHEIM",575119,2929,"",null,"OTZING"]
[null,"DIETERSHEIM","DOTTENHEIM",575119,2934,"",null,"OY-MITTELBERG"]
[null,"DIETERSHEIM","OBERROßBACH",575119,3013,"",null,"PÄHL"]
[null,"DIETERSHEIM","WALDDACHSBACH",575119,3055,"",null,"PAINTEN"]
[null,"DIETERSKIRCHEN","DIETERSKIRCHEN",376122,4907,"",null,"PAINTNER FORST"]
[null,"DIETERSKIRCHEN","BACH",376122,4908,"",null,"PALLING"]
[null,"DIETERSKIRCHEN","PRACKENDORF",376122,4909,"",null,"PAPPENHEIM"]
[null,"DIETERSKIRCHEN","WEISLITZ",376122,4910,"",null,"PARKSTEIN"]
[null,"DIETFURT A.D.ALTMÜHL","STAADORF",373121,5430,"",null,"PARKSTETTEN"]
[null,"DIETFURT A.D.ALTMÜHL","UNTERBÜRG",373121,5431,"",null,"PARSBERG"]
[null,"DIETFURT A.D.ALTMÜHL","MUTTENHOFEN",373121,5432,"",null,"PARTENSTEIN"]
[null,"DIETFURT A.D.ALTMÜHL","MALLERSTETTEN",373121,5433,"",null,"PARTENSTEINER FORST"]
[null,"DIETFURT A.D.ALTMÜHL","HAINSBERG",373121,5434,"",null,"PASSAU"]
[null,"DIETFURT A.D.ALTMÜHL","OTTMARING",373121,5435,"",null,"PASTETTEN"]
[null,"DIETFURT A.D.ALTMÜHL","DIETFURT A.D.ALTMÜHL",373121,5436,"",null,"PATERSDORF"]
[null,"DIETFURT A.D.ALTMÜHL","WILDENSTEIN",373121,5437,"",null,"PAUNZHAUSEN"]
[null,"DIETFURT A.D.ALTMÜHL","PREDLFING",373121,5438,"",null,"PECHBRUNN"]
[null,"DIETFURT A.D.ALTMÜHL","EUTENHOFEN",373121,5439,"",null,"PEGNITZ"]
[null,"DIETFURT A.D.ALTMÜHL","GUNDELSHOFEN",373121,5440,"",null,"PEIßENBERG"]
[null,"DIETFURT A.D.ALTMÜHL","TÖGING",373121,5441,"",null,"PEITING"]
[null,"DIETFURT A.D.ALTMÜHL","GRIESSTETTEN",373121,5442,"",null,"PEMFLING"]
[null,"DIETFURT A.D.ALTMÜHL","MÜHLBACH",373121,5443,"",null,"PENTLING"]
[null,"DIETFURT A.D.ALTMÜHL","SCHWEINKOFEN",373121,5444,"",null,"PENZBERG"]
[null,"DIETFURT A.D.ALTMÜHL","VOGELTHAL",373121,5445,"",null,"PENZING"]
[null,"DIETFURT A.D.ALTMÜHL","ARNSDORF",373121,5446,"",null,"PERACH"]
[null,"DIETFURT A.D.ALTMÜHL","ZELL",373121,5447,"",null,"PERASDORF"]
[null,"DIETMANNSRIED","REICHOLZRIED",780119,7657,"",null,"PERKAM"]
[null,"DIETMANNSRIED","SCHRATTENBACH",780119,7658,"",null,"PERLACHER FORST"]
[null,"DIETMANNSRIED","PROBSTRIED",780119,7659,"",null,"PERLESREUT"]
[null,"DIETMANNSRIED","DIETMANNSRIED",780119,7660,{"$f":"+IF(A1474<>\"\",1,\"\")","v":""},null,"PETERSAURACH"]
[null,"DIETMANNSRIED","ÜBERBACH",780119,7661,"",null,"PETERSDORF"]
[null,"DIETRAMSZELL","ASCHOLDING",173118,9326,"",null,"PETERSHAUSEN"]
[null,"DIETRAMSZELL","FÖGGENBEUERN",173118,9327,"",null,"PETTENDORF"]
[null,"DIETRAMSZELL","LINDEN",173118,9328,"",null,"PETTING"]
[null,"DIETRAMSZELL","BAIERNRAIN",173118,9329,"",null,"PETTSTADT"]
[null,"DIETRAMSZELL","MANHARTSHOFEN",173118,9330,"",null,"PFAFFENHAUSEN"]
[null,"DIETRAMSZELL","DIETRAMSZELL",173118,9331,"",null,"PFAFFENHOFEN A.D.GLO"]
[null,"DIETRAMSZELL","HECHENBERG",173118,9332,"",null,"PFAFFENHOFEN A.D.ILM"]
[null,"DILLINGEN A.D.DONAU","DONAUALTHEIM",773125,6860,"",null,"PFAFFENHOFEN A.D.ROT"]
[null,"DILLINGEN A.D.DONAU","SCHRETZHEIM",773125,6861,"",null,"PFAFFING"]
[null,"DILLINGEN A.D.DONAU","STEINHEIM",773125,6862,"",null,"PFAKOFEN"]
[null,"DILLINGEN A.D.DONAU","HAUSEN",773125,6863,"",null,"PFARRKIRCHEN"]
[null,"DILLINGEN A.D.DONAU","DILLINGEN A.D.DONAU",773125,6864,"",null,"PFARRWEISACH"]
[null,"DILLINGEN A.D.DONAU","FRISTINGEN",773125,6865,"",null,"PFATTER"]
[null,"DILLINGEN A.D.DONAU","KICKLINGEN",773125,6866,"",null,"PFEFFENHAUSEN"]
[null,"DINGOLFING","DINGOLFING",279112,6151,"",null,"PFOFELD"]
[null,"DINGOLFING","FRAUENBIBURG",279112,6152,"",null,"PFÖRRING"]
[null,"DINGOLFING","TEISBACH",279112,6153,"",null,"PFORZEN"]
[null,"DINGOLSHAUSEN","BISCHWIND",678122,1021,"",null,"PFREIMD"]
[null,"DINGOLSHAUSEN","DINGOLSHAUSEN",678122,1038,"",null,"PFRONTEN"]
[null,"DINKELSBÜHL","DINKELSBÜHL",571136,2930,"",null,"PHILIPPSREUT"]
[null,"DINKELSBÜHL","ESBACH",571136,2944,"",null,"PHILIPPSREUTER WALD"]
[null,"DINKELSBÜHL","HELLENBACH",571136,2969,"",null,"PIDING"]
[null,"DINKELSBÜHL","LANGENSTEINBACH",571136,2986,"",null,"PIELENHOFEN"]
[null,"DINKELSBÜHL","NEUSTÄDTLEIN",571136,3002,"",null,"PIELENHOFER WALD L.D.NAAB"]
[null,"DINKELSBÜHL","OBERRADACH",571136,3012,"",null,"PIELENHOFER WALD R.D.NAAB"]
[null,"DINKELSBÜHL","SEGRINGEN",571136,3033,"",null,"PILSACH"]
[null,"DINKELSBÜHL","SEIDELSDORF",571136,3034,"",null,"PILSTING"]
[null,"DINKELSBÜHL","SINBRONN",571136,3036,"",null,"PINZBERG"]
[null,"DINKELSBÜHL","WALDECK",571136,3056,"",null,"PIRK"]
[null,"DINKELSBÜHL","WALDHÄUSLEIN",571136,3057,"",null,"PITTENHART"]
[null,"DINKELSBÜHL","WEIDELBACH",571136,3060,"",null,"PLANEGG"]
[null,"DINKELSBÜHL","WOLFERTSBRONN",571136,3070,"",null,"PLANKENFELS"]
[null,"DINKELSCHERBEN","DINKELSCHERBEN",772131,7258,"",null,"PLATTLING"]
[null,"DINKELSCHERBEN","GRÜNENBAINDT",772131,7259,"",null,"PLECH"]
[null,"DINKELSCHERBEN","FLEINHAUSEN",772131,7260,"",null,"PLECKENSTEINER WALD"]
[null,"DINKELSCHERBEN","LINDACH",772131,7261,"",null,"PLEINFELD"]
[null,"DINKELSCHERBEN","HÄDER",772131,7262,"",null,"PLEISKIRCHEN"]
[null,"DINKELSCHERBEN","ETTELRIED",772131,7263,"",null,"PLEß"]
[null,"DINKELSCHERBEN","ANRIED",772131,7264,"",null,"PLEYSTEIN"]
[null,"DINKELSCHERBEN","OBERSCHÖNEBERG",772131,7265,"",null,"PLIENING"]
[null,"DINKELSCHERBEN","BREITENBRONN",772131,7266,"",null,"PLÖßBERG"]
[null,"DINKELSCHERBEN","HOLZARA",772131,7267,"",null,"POCKING"]
[null,"DINKELSCHERBEN","RIED",772131,7268,"",null,"PÖCKING"]
[null,"DIRLEWANG","DIRLEWANG",778127,7797,"",null,"POING"]
[null,"DIRLEWANG","ALTENSTEIG",778127,7798,"",null,"POLLENFELD"]
[null,"DIRLEWANG","HELCHENRIED",778127,7799,"",null,"POLLING"]
[null,"DITTELBRUNN","PFÄNDHAUSEN",678123,831,"",null,"POLSINGEN"]
[null,"DITTELBRUNN","HOLZHAUSEN",678123,844,"",null,"POMMELSBRUNN"]
[null,"DITTELBRUNN","HAMBACH",678123,858,"",null,"POMMERSFELDEN"]
[null,"DITTELBRUNN","DITTELBRUNN",678123,874,"",null,"POPPENHAUSEN"]
[null,"DITTENHEIM","SAUSENHOFEN",577122,3629,"",null,"POPPENRICHT"]
[null,"DITTENHEIM","WINDSFELD",577122,3630,"",null,"PÖRNBACH"]
[null,"DITTENHEIM","SAMMENHEIM",577122,3631,"",null,"PÖSING"]
[null,"DITTENHEIM","DITTENHEIM",577122,3632,"",null,"POSTAU"]
[null,"DÖHLAU","KAUTENDORF",475120,1974,"",null,"POSTBAUER-HENG"]
[null,"DÖHLAU","DÖHLAU",475120,1975,"",null,"POSTMÜNSTER"]
[null,"DÖHLAU","TAUPERLITZ",475120,1976,"",null,"POTTENSTEIN"]
[null,"DOLLNSTEIN","HAUNSFELD",176121,4049,"",null,"PÖTTMES"]
[null,"DOLLNSTEIN","EBERSWANG",176121,4051,"",null,"POXDORF"]
[null,"DOLLNSTEIN","OBEREICHSTÄTT",176121,4052,"",null,"PRACKENBACH"]
[null,"DOLLNSTEIN","DOLLNSTEIN",176121,4053,"",null,"PREBITZ"]
[null,"DOLLNSTEIN","BREITENFURT",176121,4054,"",null,"PREM"]
[null,"DOMBÜHL","DOMBÜHL",571137,2931,{"$f":"+IF(A1538<>\"\",1,\"\")","v":""},null,"PRESSATH"]
[null,"DOMBÜHL","KLOSTER SULZ",571137,2982,"",null,"PRESSATHER WALD"]
[null,"DONAUSTAUF","DONAUSTAUF",375130,5223,"",null,"PRESSECK"]
[null,"DONAUSTAUF","SULZBACH A.D.DONAU",375130,5336,"",null,"PRESSIG"]
[null,"DONAUWÖRTH","WÖRNITZSTEIN",779131,6946,"",null,"PRETZFELD"]
[null,"DONAUWÖRTH","BERG",779131,6947,"",null,"PRICHSENSTADT"]
[null,"DONAUWÖRTH","DONAUWÖRTH",779131,6948,"",null,"PRIEN A.CHIEMSEE"]
[null,"DONAUWÖRTH","SCHÄFSTALL",779131,6949,"",null,"PRIESENDORF"]
[null,"DONAUWÖRTH","ZIRGESHEIM",779131,6950,"",null,"PRITTRICHING"]
[null,"DONAUWÖRTH","RIEDLINGEN",779131,6951,"",null,"PROSSELSHEIM"]
[null,"DONAUWÖRTH","NORDHEIM",779131,6952,"",null,"PRÜLL"]
[null,"DONAUWÖRTH","ZUSUM",779131,6953,"",null,"PRUTTING"]
[null,"DONAUWÖRTH","AUCHSESHEIM",779131,6954,"",null,"PÜCHERSREUTH"]
[null,"DONNERSDORF","PUSSELSHEIM",678124,958,"",null,"PUCHHEIM"]
[null,"DONNERSDORF","TUGENDORF",678124,981,"",null,"PULLACH I.ISARTAL"]
[null,"DONNERSDORF","DONNERSDORF",678124,982,"",null,"PULLENREUTH"]
[null,"DONNERSDORF","FALKENSTEIN",678124,983,"",null,"PUPPLINGER AU"]
[null,"DONNERSDORF","KLEINRHEINFELD",678124,1004,"",null,"PÜRGEN"]
[null,"DONNERSDORF","TRAUSTADT",678124,1005,"",null,"PUSCHENDORF"]
[null,"DORFEN","EIBACH",177115,8377,"",null,"PUTZBRUNN"]
[null,"DORFEN","GRÜNTEGERNBACH",177115,8378,"",null,"PYRBAUM"]
[null,"DORFEN","ZEILHOFEN",177115,8383,"",null,"RAIN"]
[null,"DORFEN","DORFEN",177115,8384,"",null,"RAISTING"]
[null,"DORFEN","HAUSMEHRING",177115,8385,"",null,"RAITENBUCH"]
[null,"DORFEN","WASENTEGERNBACH",177115,8386,"",null,"RAMERBERG"]
[null,"DORFEN","WATZLING",177115,8393,"",null,"RAMMINGEN"]
[null,"DORFEN","STOLLNKIRCHEN",177115,8394,"",null,"RAMSAU B.BERCHTESGAD"]
[null,"DORFEN","SCHWINDKIRCHEN",177115,8395,"",null,"RAMSTHAL"]
[null,"DORFEN","SCHILTERN",177115,8396,"",null,"RANDERSACKER"]
[null,"DÖRFLES-ESBACH","DÖRFLES B.COBURG",473120,1334,"",null,"RANNUNGEN"]
[null,"DÖRFLES-ESBACH","ESBACH",473120,1344,"",null,"RATTELSDORF"]
[null,"DORFPROZELTEN","DORFPROZELTEN",676118,439,"",null,"RATTENBERG"]
[null,"DORMITZ","DORMITZ",474119,2710,"",null,"RATTENKIRCHEN"]
[null,"DORMITZER FORST","DORMITZER FORST",572453,2768,"",null,"RATTISZELL"]
[null,"DORNSTADT-LINKERSBAINDT","DORNSTADT-LINKERSBAINDT",779452,6707,"",null,"RAUBLING"]
[null,"DRACHSELSRIED","DRACHSELSRIED",276120,5709,"",null,"RAUHENEBRACH"]
[null,"DREISTELZER FORST","DREISTELZER FORST",672451,182,"",null,"RECHTENBACH"]
[null,"DUGGENDORF","HOCHDORF",375131,5466,"",null,"RECHTMEHRING"]
[null,"DUGGENDORF","WISCHENHOFEN",375131,5467,"",null,"RECKENDORF"]
[null,"DUGGENDORF","DUGGENDORF",375131,5468,"",null,"REDNITZHEMBACH"]
[null,"DUGGENDORF","HEITZENHOFEN",375131,5469,"",null,"REDWITZ A.D.RODACH"]
[null,"DURACH","DURACH",780120,7673,"",null,"REGEN"]
[null,"DURACH","BODELSBERG",780120,7674,"",null,"REGENSBURG"]
[null,"DÜRNBUCHER FORST","DÜRNBUCHER FORST",273451,6017,"",null,"REGENSTAUF"]
[null,"DÜRRLAUINGEN","MINDELALTHEIM",774127,7120,"",null,"REGNITZLOSAU"]
[null,"DÜRRLAUINGEN","DÜRRLAUINGEN",774127,7121,"",null,"REHAU"]
[null,"DÜRRLAUINGEN","MÖNSTETTEN",774127,7122,"",null,"REHLING"]
[null,"DÜRRWANGEN","DÜRRWANGEN",571139,2935,"",null,"REICHENBACH"]
[null,"DÜRRWANGEN","HALSBACH",571139,2964,"",null,"REICHENBERG"]
[null,"DÜRRWANGEN","HASLACH",571139,2967,"",null,"REICHENSCHWAND"]
[null,"DÜRRWANGEN","NEUSES",571139,3000,"",null,"REICHERSBEUERN"]
[null,"DÜRRWANGEN","SULZACH",571139,3041,"",null,"REICHERTSHAUSEN"]
[null,"EBELSBACH","SCHÖNBACH",674129,945,"",null,"REICHERTSHEIM"]
[null,"EBELSBACH","STEINBACH",674129,966,"",null,"REICHERTSHOFEN"]
[null,"EBELSBACH","EBELSBACH",674129,967,"",null,"REICHLING"]
[null,"EBELSBACH","GLEISENAU",674129,968,"",null,"REIMLINGEN"]
[null,"EBELSBACH","SCHÖNBRUNN",674129,969,"",null,"REISBACH"]
[null,"EBELSBACH","RUDENDORF",674129,970,"",null,"REISCHACH"]
[null,"EBENSFELD","BIRKACH",478120,1311,"",null,"REIT IM WINKL"]
[null,"EBENSFELD","DITTERSBRUNN",478120,1333,"",null,"REMLINGEN"]
[null,"EBENSFELD","DÖRINGSTADT",478120,1335,"",null,"RENNERTSHOFEN"]
[null,"EBENSFELD","DRAISDORF",478120,1336,"",null,"RENTWEINSDORF"]
[null,"EBENSFELD","EBENSFELD",478120,1338,"",null,"RETTENBACH"]
[null,"EBENSFELD","EGGENBACH",478120,1341,"",null,"RETTENBACH A.AUERBER"]
[null,"EBENSFELD","FREIBERG",478120,1350,{"$f":"+IF(A1602<>\"\",1,\"\")","v":""},null,"RETTENBERG"]
[null,"EBENSFELD","KLEUKHEIM",478120,1390,"",null,"RETZSTADT"]
[null,"EBENSFELD","KÜMMEL",478120,1395,"",null,"REUDELBERG"]
[null,"EBENSFELD","MESSENFELD",478120,1412,"",null,"REUT"]
[null,"EBENSFELD","OBERBRUNN",478120,1437,"",null,"REUTH B.ERBENDORF"]
[null,"EBENSFELD","OBERKÜPS",478120,1439,"",null,"RIED"]
[null,"EBENSFELD","PRÄCHTING",478120,1452,"",null,"RIEDBACH"]
[null,"EBENSFELD","UNTERBRUNN",478120,1502,"",null,"RIEDEN"]
[null,"EBENSFELD","UNTERNEUSES",478120,1506,"",null,"RIEDEN A.FORGGENSEE"]
[null,"EBERFING","ARNRIED",190120,9222,"",null,"RIEDENBERG"]
[null,"EBERFING","EBERFING",190120,9223,"",null,"RIEDENBURG"]
[null,"EBERMANNSDORF","EBERMANNSDORF",371118,4538,"",null,"RIEDENHEIM"]
[null,"EBERMANNSDORF","DIEBIS",371118,4552,"",null,"RIEDERING"]
[null,"EBERMANNSDORF","PITTERSBERG",371118,4553,"",null,"RIEGSEE"]
[null,"EBERMANNSDORF","AU",371118,4554,"",null,"RIEKOFEN"]
[null,"EBERMANNSDORF","BREITENBRUNN",371118,4555,"",null,"RIENECK"]
[null,"EBERMANNSTADT","WOHLMANNSGESEES",474121,2608,"",null,"RIMBACH"]
[null,"EBERMANNSTADT","ESCHLIPP",474121,2622,"",null,"RIMPAR"]
[null,"EBERMANNSTADT","GASSELDORF",474121,2623,"",null,"RIMSTING"]
[null,"EBERMANNSTADT","BREITENBACH",474121,2624,"",null,"RINCHNACH"]
[null,"EBERMANNSTADT","NIEDERMIRSBERG",474121,2625,"",null,"RINGELAI"]
[null,"EBERMANNSTADT","EBERMANNSTADT",474121,2626,"",null,"RÖCKINGEN"]
[null,"EBERMANNSTADT","NEUSES",474121,2627,"",null,"RÖDELMAIER"]
[null,"EBERMANNSTADT","RÜSSENBACH",474121,2628,"",null,"RÖDELSEE"]
[null,"EBERMANNSTADT","WOHLMUTHSHÜLL",474121,2629,"",null,"RODEN"]
[null,"EBERMANNSTADT","BURGGAILLENREUTH",474121,2630,"",null,"RÖDENTAL"]
[null,"EBERMANNSTADT","MOGGAST",474121,2631,"",null,"RODING"]
[null,"EBERN","ALBERSDORF",674130,2101,"",null,"RÖFINGEN"]
[null,"EBERN","BISCHWIND A.RAUENECK",674130,2114,"",null,"ROGGENBURG"]
[null,"EBERN","BRAMBERG",674130,2117,"",null,"RÖGLING"]
[null,"EBERN","BRAMBERGER WALD",674130,2118,"",null,"ROHR"]
[null,"EBERN","BRÜNN",674130,2120,"",null,"ROHR I.NB"]
[null,"EBERN","EBERN",674130,2145,"",null,"ROHRBACH"]
[null,"EBERN","EICHELBERG",674130,2151,"",null,"ROHRBRUNNER FORST"]
[null,"EBERN","EYRICHSHOF",674130,2157,"",null,"ROHRDORF"]
[null,"EBERN","FISCHBACH",674130,2158,"",null,"ROHRENFELS"]
[null,"EBERN","HAßWALD-NORD",674130,2181,"",null,"RÖHRMOOS"]
[null,"EBERN","HAßWALD-SÜD",674130,2182,"",null,"RÖHRNBACH"]
[null,"EBERN","HAUBE",674130,2183,"",null,"RÖLLBACH"]
[null,"EBERN","HEUBACH",674130,2188,"",null,"RÖMERSHAGER FORST-NORD"]
[null,"EBERN","JESSERNDORF",674130,2197,"",null,"RÖMERSHAGER FORST-OST"]
[null,"EBERN","NEUSES A.RAUENECK",674130,2240,"",null,"RONSBERG"]
[null,"EBERN","RECHELDORF",674130,2261,"",null,"ROSENHEIM"]
[null,"EBERN","REUTERSBRUNN",674130,2269,"",null,"RÖSLAU"]
[null,"EBERN","UNTERPREPPACH",674130,2321,"",null,"ROßBACH"]
[null,"EBERN","VORBACH",674130,2328,"",null,"ROßBACHER FORST"]
[null,"EBERN","WEIßENBRUNN",674130,2334,"",null,"ROßHAUPTEN"]
[null,"EBERN","WELKENDORF",674130,2335,"",null,"ROßTAL"]
[null,"EBERSBERG","EBERSBERG",175115,8755,"",null,"ROTH"]
[null,"EBERSBERG","OBERNDORF",175115,8769,"",null,"RÖTHENBACH A.D.PEGNI"]
[null,"EBERSBERG","ANZINGER FORST",175115,8782,"",null,"RÖTHENBACH I.ALLGÄU"]
[null,"EBERSBERG","EBERSBERGER FORST",175115,8783,"",null,"ROTHENBERG"]
[null,"EBERSBERG","EGLHARTINGER FORST",175115,8784,"",null,"ROTHENBUCH"]
[null,"EBERSBERGER FORST","EBERSBERGER FORST",175452,8783,"",null,"ROTHENBUCHER FORST"]
[null,"EBERSDORF B.COBURG","COBURGER FORST-SÜDOST",473121,1329,"",null,"ROTHENBURG O.D.TAUBE"]
[null,"EBERSDORF B.COBURG","EBERSDORF B.COBURG",473121,1339,"",null,"ROTHENFELS"]
[null,"EBERSDORF B.COBURG","FRIESENDORF",473121,1351,"",null,"RÖTHLEIN"]
[null,"EBERSDORF B.COBURG","FROHNLACH",473121,1352,"",null,"ROTT"]
[null,"EBERSDORF B.COBURG","GROßGARNSTADT",473121,1362,"",null,"ROTT A.INN"]
[null,"EBERSDORF B.COBURG","KLEINGARNSTADT",473121,1388,"",null,"ROTTACH-EGERN"]
[null,"EBERSDORF B.COBURG","OBERFÜLLBACH",473121,1440,"",null,"RÖTTENBACH"]
[null,"EBERSHAUSEN","SEIFERTSHOFEN",774129,7709,"",null,"ROTTENBUCH"]
[null,"EBERSHAUSEN","EBERSHAUSEN",774129,7710,"",null,"ROTTENBURG A.D.LAABE"]
[null,"EBERSHAUSER-NATTENHAUSER WALD","SEIFERTSHOFEN",774451,7709,"",null,"ROTTENDORF"]
[null,"EBNATH","EBNATH",377115,4202,{"$f":"+IF(A1666<>\"\",1,\"\")","v":""},null,"ROTTER FORST-NORD"]
[null,"EBRACH","BUCH",471128,2123,"",null,"ROTTER FORST-SÜD"]
[null,"EBRACH","EBRACH",471128,2147,"",null,"ROTTHALMÜNSTER"]
[null,"EBRACH","GROßBIRKACH",471128,2170,"",null,"RÖTTINGEN"]
[null,"EBRACH","GROßGRESSINGEN",471128,2171,"",null,"RÖTZ"]
[null,"EBRACH","NEUDORF B.EBRACH",471128,2237,"",null,"RÜCKERSDORF"]
[null,"EBRACHER FORST","EBRACH",471452,2147,"",null,"RÜCKERSDORFER FORST"]
[null,"ECHING (LKR. FS)","GÜNZENHAUSEN",178120,8333,"",null,"RÜCKHOLZ"]
[null,"ECHING (LKR. FS)","ECHING",178120,8334,"",null,"RUDELZHAUSEN"]
[null,"ECHING (LKR. LA)","ECHING",274124,6635,"",null,"RÜDENAU"]
[null,"ECHING (LKR. LA)","KRONWINKL",274124,6636,"",null,"RÜDENHAUSEN"]
[null,"ECHING (LKR. LA)","BERGHOFEN",274124,6637,"",null,"RUDERATSHOFEN"]
[null,"ECHING (LKR. LA)","HAUNWANG",274124,6638,"",null,"RUDERTING"]
[null,"ECHING (LKR. LA)","VIECHT",274124,6639,"",null,"RUGENDORF"]
[null,"ECHING A.AMMERSEE","ECHING A.AMMERSEE",181115,9011,"",null,"RÜGLAND"]
[null,"ECK","ECK",172452,9966,"",null,"RUHMANNSFELDEN"]
[null,"ECKARTSER HART U.FONDSBERG","ECKARTS-RUPBODEN",672452,181,"",null,"RUHPOLDING"]
[null,"ECKENTAL","BENZENDORF",572121,2756,"",null,"RUHSTORF A.D.ROTT"]
[null,"ECKENTAL","BRAND",572121,2759,"",null,"RUNDING"]
[null,"ECKENTAL","BÜG",572121,2766,"",null,"RUPPERTSHÜTTENER FORST"]
[null,"ECKENTAL","ECKENHAID",572121,2770,"",null,"SAAL A.D.DONAU"]
[null,"ECKENTAL","ESCHENAU",572121,2774,"",null,"SAAL A.D.SAALE"]
[null,"ECKENTAL","FORTH",572121,2779,"",null,"SAALDORF"]
[null,"ECKENTAL","HERPERSDORF",572121,2795,"",null,"SACHSEN B.ANSBACH"]
[null,"ECKENTAL","OBERSCHÖLLENBACH",572121,2826,"",null,"SACHSENKAM"]
[null,"ECKENTAL","UNTERSCHÖLLENBACH",572121,2838,"",null,"SAILAUF"]
[null,"ECKERSDORF","NEUSTÄDTLEIN A.FORST",472131,2417,"",null,"SAILAUFER FORST"]
[null,"ECKERSDORF","BUSBACH",472131,2418,"",null,"SALCHING"]
[null,"ECKERSDORF","ESCHEN",472131,2419,"",null,"SALDENBURG"]
[null,"ECKERSDORF","OBERWAIZ",472131,2420,"",null,"SALGEN"]
[null,"ECKERSDORF","DONNDORF",472131,2421,"",null,"SALZ"]
[null,"ECKERSDORF","ECKERSDORF",472131,2422,"",null,"SALZWEG"]
[null,"ECKERSDORF","FORST NEUSTÄDTLEIN A.FORST",472131,2423,"",null,"SAMERBERG"]
[null,"EDELSFELD","KÜRMREUTH",371119,4453,"",null,"SAND A.MAIN"]
[null,"EDELSFELD","NAMSREUTH",371119,4454,"",null,"SANDBERG"]
[null,"EDELSFELD","SIGRAS",371119,4455,"",null,"SANKT OSWALD"]
[null,"EDELSFELD","HOLNSTEIN",371119,4469,"",null,"SAUERLACH"]
[null,"EDELSFELD","EDELSFELD",371119,4470,"",null,"SAULGRUB"]
[null,"EDELSFELD","STEINLING",371119,4471,"",null,"SCHÄFTLARN"]
[null,"EDELSFELD","WEIßENBERG",371119,4472,"",null,"SCHALKHAM"]
[null,"EDERHEIM","EDERHEIM",779136,6753,"",null,"SCHAUENSTEIN"]
[null,"EDERHEIM","HÜRNHEIM",779136,6754,"",null,"SCHAUFLING"]
[null,"EDERHEIM","CHRISTGARTEN",779136,6755,"",null,"SCHECHEN"]
[null,"EDLING","STEPPACH",187124,9747,"",null,"SCHEIDEGG"]
[null,"EDLING","EDLING",187124,9748,"",null,"SCHEINFELD"]
[null,"EFFELTRICH","GAIGANZ",474122,2686,"",null,"SCHELLENBERGER FORST"]
[null,"EFFELTRICH","EFFELTRICH",474122,2687,"",null,"SCHERNFELD"]
[null,"EGENHOFEN","EGENHOFEN",179117,8451,"",null,"SCHERSTETTEN"]
[null,"EGENHOFEN","AUFKIRCHEN",179117,8452,"",null,"SCHEßLITZ"]
[null,"EGENHOFEN","OBERWEIKERTSHOFEN",179117,8453,"",null,"SCHEURING"]
[null,"EGENHOFEN","UNTERSCHWEINBACH",179117,8454,"",null,"SCHEYERN"]
[null,"EGENHOFEN","WENIGMÜNCHEN",179117,8455,"",null,"SCHIERLING"]
[null,"EGG A.D.GÜNZ","ENGISHAUSEN",778130,7545,"",null,"SCHILLINGSFÜRST"]
[null,"EGG A.D.GÜNZ","INNEBERG",778130,7546,"",null,"SCHILTBERG"]
[null,"EGG A.D.GÜNZ","EGG A.D.GÜNZ",778130,7547,"",null,"SCHIRMITZ"]
[null,"EGG A.D.GÜNZ","EGGER WALD",778130,7548,"",null,"SCHIRNDING"]
[null,"EGGENFELDEN","EGGENFELDEN",277116,6409,"",null,"SCHLAMMERSDORF"]
[null,"EGGENFELDEN","GERN",277116,6417,"",null,"SCHLECHING"]
[null,"EGGENFELDEN","HAMMERSBACH",277116,6419,"",null,"SCHLEHDORF"]
[null,"EGGENFELDEN","HULDSESSEN",277116,6424,"",null,"SCHLICHTENBERGER WALD"]
[null,"EGGENFELDEN","KIRCHBERG",277116,6427,"",null,"SCHLIERSEE"]
[null,"EGGENFELDEN","PETERSKIRCHEN",277116,6449,"",null,"SCHLÜSSELFELD"]
[null,"EGGENFELDEN","TAUFKIRCHEN",277116,6468,"",null,"SCHMELLERFORST"]
[null,"EGGENTHAL","BAYERSRIED",777124,7839,"",null,"SCHMIDGADEN"]
[null,"EGGENTHAL","EGGENTHAL",777124,7840,{"$f":"+IF(A1730<>\"\",1,\"\")","v":""},null,"SCHMIDMÜHLEN"]
[null,"EGGLHAM","AMSHAM",277117,6401,"",null,"SCHMIECHEN"]
[null,"EGGLHAM","EGGLHAM",277117,6410,"",null,"SCHNABELWAID"]
[null,"EGGLKOFEN","EGGLKOFEN",183115,8803,"",null,"SCHNAITSEE"]
[null,"EGGLKOFEN","HARPOLDEN",183115,8805,"",null,"SCHNAITTACH"]
[null,"EGGLKOFEN","TEGERNBACH",183115,8806,"",null,"SCHNAITTENBACH"]
[null,"EGGOLSHEIM","TIEFENSTÜRMIG",474123,2609,"",null,"SCHNECKENLOHE"]
[null,"EGGOLSHEIM","GÖTZENDORF",474123,2610,"",null,"SCHNEEBERG"]
[null,"EGGOLSHEIM","DRÜGENDORF",474123,2611,"",null,"SCHNEIZLREUTH"]
[null,"EGGOLSHEIM","DROSENDORF A.EGGERBACH",474123,2612,"",null,"SCHNELLDORF"]
[null,"EGGOLSHEIM","UNTERSTÜRMIG",474123,2613,"",null,"SCHÖFWEG"]
[null,"EGGOLSHEIM","WEIGELSHOFEN",474123,2614,"",null,"SCHOLLBRUNN"]
[null,"EGGOLSHEIM","NEUSES A.D.REGNITZ",474123,2615,"",null,"SCHÖLLKRIPPEN"]
[null,"EGGOLSHEIM","EGGOLSHEIM",474123,2616,"",null,"SCHÖLLKRIPPENER FORST"]
[null,"EGGOLSHEIM","KAUERNHOFEN",474123,2617,"",null,"SCHÖLLNACH"]
[null,"EGGOLSHEIM","RETTERN",474123,2618,"",null,"SCHÖNAU"]
[null,"EGGOLSHEIM","BAMMERSDORF",474123,2619,"",null,"SCHÖNAU A.D.BREND"]
[null,"EGGSTÄTT","EGGSTÄTT",187125,9613,"",null,"SCHÖNAU A.KÖNIGSSEE"]
[null,"EGING A.SEE","EGING A.SEE",275120,6251,"",null,"SCHÖNBERG"]
[null,"EGING A.SEE","GARHAM",275120,6255,"",null,"SCHÖNBRUNN I.STEIGER"]
[null,"EGLFING","EGLFING",190121,9226,"",null,"SCHÖNBRUNNER WALD"]
[null,"EGLHARTINGER FORST","EGLHARTINGER FORST",175453,8784,"",null,"SCHONDORF A.AMMERSEE"]
[null,"EGLING","DEINING",173120,9311,"",null,"SCHONDRA"]
[null,"EGLING","ERGERTSHAUSEN",173120,9312,"",null,"SCHONGAU"]
[null,"EGLING","NEUFAHRN",173120,9313,"",null,"SCHÖNGEISING"]
[null,"EGLING","EGLING",173120,9314,"",null,"SCHÖNSEE"]
[null,"EGLING","THANNING",173120,9315,"",null,"SCHONSTETT"]
[null,"EGLING","ENDLHAUSEN",173120,9316,"",null,"SCHÖNTHAL"]
[null,"EGLING","MOOSHAM",173120,9317,"",null,"SCHONUNGEN"]
[null,"EGLING A.D.PAAR","EGLING A.D.PAAR",181116,9012,"",null,"SCHÖNWALD"]
[null,"EGLING A.D.PAAR","HEINRICHSHOFEN",181116,9025,"",null,"SCHOPFLOCH"]
[null,"EGLOFFSTEIN","ZAUNSBACH",474124,2637,"",null,"SCHORNDORF"]
[null,"EGLOFFSTEIN","BIEBERBACH",474124,2666,"",null,"SCHROBENHAUSEN"]
[null,"EGLOFFSTEIN","HUNDSHAUPTEN",474124,2667,"",null,"SCHWABACH"]
[null,"EGLOFFSTEIN","EGLOFFSTEIN",474124,2668,"",null,"SCHWABBRUCK"]
[null,"EGLOFFSTEIN","AFFALTERTHAL",474124,2669,"",null,"SCHWABHAUSEN"]
[null,"EGMATING","EGMATING",175116,8756,"",null,"SCHWABMÜNCHEN"]
[null,"EGWEIL","EGWEIL",176122,4062,"",null,"SCHWABSOIEN"]
[null,"EHEKIRCHEN","FERNMITTENHAUSEN",185127,7028,"",null,"SCHWAIG B.NÜRNBERG"]
[null,"EHEKIRCHEN","BONSAL",185127,7029,"",null,"SCHWAIGEN"]
[null,"EHEKIRCHEN","HOLLENBACH",185127,7030,"",null,"SCHWAIGHAUSER FORST"]
[null,"EHEKIRCHEN","BUCH",185127,7031,"",null,"SCHWANDER FORST"]
[null,"EHEKIRCHEN","AMBACH",185127,7032,"",null,"SCHWANDORF"]
[null,"EHEKIRCHEN","DINKELSHAUSEN",185127,7033,"",null,"SCHWANFELD"]
[null,"EHEKIRCHEN","EHEKIRCHEN",185127,7034,"",null,"SCHWANGAU"]
[null,"EHEKIRCHEN","HASELBACH",185127,7035,"",null,"SCHWANSTETTEN"]
[null,"EHEKIRCHEN","SCHÖNESBERG",185127,7036,"",null,"SCHWARZACH"]
[null,"EHEKIRCHEN","WEIDORF",185127,7037,"",null,"SCHWARZACH A.MAIN"]
[null,"EHEKIRCHEN","WALDA",185127,7038,"",null,"SCHWARZACH B.NABBURG"]
[null,"EHINGEN (LKR. A)","EHINGEN",772134,6984,"",null,"SCHWARZENBACH"]
[null,"EHINGEN (LKR. A)","ORTLFINGEN",772134,6985,"",null,"SCHWARZENBACH A.D.SA"]
[null,"EHINGEN (LKR. AN)","BEYERBERG",571141,3654,"",null,"SCHWARZENBACH A.WALD"]
[null,"EHINGEN (LKR. AN)","EHINGEN",571141,3655,"",null,"SCHWARZENBRUCK"]
[null,"EHINGEN (LKR. AN)","DAMBACH",571141,3656,"",null,"SCHWARZENFELD"]
[null,"EHINGEN (LKR. AN)","LENTERSHEIM",571141,3657,"",null,"SCHWARZHOFEN"]
[null,"EHINGEN A.RIES","BELZHEIM",779138,6711,"",null,"SCHWEBHEIM"]
[null,"EHINGEN A.RIES","EHINGEN A.RIES",779138,6712,"",null,"SCHWEINFURT"]
[null,"EIBELSTADT","EIBELSTADT",679124,723,"",null,"SCHWEITENKIRCHEN"]
[null,"EICHEN","AMMERTHAL",371452,4512,"",null,"SCHWENNINGEN"]
[null,"EICHEN","EICHEN",371452,4513,"",null,"SCHWIFTING"]
[null,"EICHENAU","ALLING",179118,8497,"",null,"SCHWINDEGG"]
[null,"EICHENBÜHL","EICHENBÜHL",676119,457,"",null,"SEEFELD"]
[null,"EICHENBÜHL","HEPPDIEL",676119,466,"",null,"SEEG"]
[null,"EICHENBÜHL","WINDISCHBUCHEN",676119,471,"",null,"SEEHAUSEN A.STAFFELS"]
[null,"EICHENBÜHL","RIEDERN",676119,472,{"$f":"+IF(A1794<>\"\",1,\"\")","v":""},null,"SEEON-SEEBRUCK"]
[null,"EICHENDORF","ADLDORF",279113,6154,"",null,"SEESHAUPT"]
[null,"EICHENDORF","AUFHAUSEN",279113,6155,"",null,"SEGNITZ"]
[null,"EICHENDORF","DORNACH",279113,6156,"",null,"SEINSHEIM"]
[null,"EICHENDORF","EICHENDORF",279113,6157,"",null,"SELB"]
[null,"EICHENDORF","ETTLING",279113,6158,"",null,"SELBER FORST"]
[null,"EICHENDORF","EXING",279113,6159,"",null,"SELBITZ"]
[null,"EICHENDORF","HARTKIRCHEN",279113,6160,"",null,"SEMBERG"]
[null,"EICHENDORF","INDERSBACH",279113,6161,"",null,"SENDEN"]
[null,"EICHENDORF","KAMMERN",279113,6162,"",null,"SENGENTHAL"]
[null,"EICHENDORF","REICHSTORF",279113,6163,"",null,"SENNFELD"]
[null,"EICHENDORF","RENGERSDORF I",279113,6164,"",null,"SEßLACH"]
[null,"EICHSTÄTT","PREITH",176123,4016,"",null,"SEUBERSDORF I.D.OPF."]
[null,"EICHSTÄTT","WINTERSHOF",176123,4032,"",null,"SEUKENDORF"]
[null,"EICHSTÄTT","BUCHENHÜLL",176123,4033,"",null,"SEYBOTHENREUTH"]
[null,"EICHSTÄTT","MARIENSTEIN",176123,4034,"",null,"SIEGENBURG"]
[null,"EICHSTÄTT","EICHSTÄTT",176123,4035,"",null,"SIEGSDORF"]
[null,"EICHSTÄTT","LANDERSHOFEN",176123,4036,"",null,"SIELENBACH"]
[null,"EICHSTÄTT","WASSERZELL",176123,4037,"",null,"SIGMARSZELL"]
[null,"EICHSTÄTT","PARK",176123,4038,"",null,"SIMBACH"]
[null,"EICHSTÄTT","PIETENFELD",176123,4055,"",null,"SIMBACH A.INN"]
[null,"EICHWALD","EICHWALD",471453,2152,"",null,"SIMMELSDORF"]
[null,"EINSIEDLER/WALDERBACHER FORST","SOLLBACH",376453,4943,"",null,"SIMMERSHOFEN"]
[null,"EISELFING","BACHMEHRING",187126,9767,"",null,"SINDELSDORF"]
[null,"EISELFING","FREIHAM",187126,9768,"",null,"SINZING"]
[null,"EISELFING","SCHÖNBERG",187126,9769,"",null,"SÖCHTENAU"]
[null,"EISELFING","AHAM",187126,9770,"",null,"SOLNHOFEN"]
[null,"EISENBERG","EISENBERG",777125,7902,"",null,"SOMMERACH"]
[null,"EISENHEIM","UNTEREISENHEIM",679167,673,"",null,"SOMMERHAUSEN"]
[null,"EISENHEIM","OBEREISENHEIM",679167,674,"",null,"SOMMERKAHL"]
[null,"EISINGEN","EISINGEN",679126,704,"",null,"SONDERHOFEN"]
[null,"EITENSHEIM","EITENSHEIM",176124,4045,"",null,"SONDHEIM V.D.RHÖN"]
[null,"EITTING","EITTING",177116,8363,"",null,"SONNEFELD"]
[null,"ELCHINGEN","THALFINGEN",775139,7051,"",null,"SONNEN"]
[null,"ELCHINGEN","OBERELCHINGEN",775139,7052,"",null,"SONNENWALD"]
[null,"ELCHINGEN","UNTERELCHINGEN",775139,7053,"",null,"SONTHEIM"]
[null,"ELFERSHAUSEN","ELFERSHAUSEN",672121,265,"",null,"SONTHOFEN"]
[null,"ELFERSHAUSEN","TRIMBERG",672121,281,"",null,"SOOS"]
[null,"ELFERSHAUSEN","ENGENTHAL",672121,282,"",null,"SOPHIENTHALER FORST"]
[null,"ELFERSHAUSEN","LANGENDORF",672121,286,"",null,"SOYEN"]
[null,"ELFERSHAUSEN","MACHTILSHAUSEN",672121,287,"",null,"SPALT"]
[null,"ELLGAU","ELLGAU",772136,6986,"",null,"SPARDORF"]
[null,"ELLINGEN","STOPFENHEIM",577125,3710,"",null,"SPARNECK"]
[null,"ELLINGEN","MASSENBACH",577125,3711,"",null,"SPATZENHAUSEN"]
[null,"ELLINGEN","ELLINGEN",577125,3712,"",null,"SPEICHERSDORF"]
[null,"ELLZEE","HAUSEN/GZ",774133,7156,"",null,"SPEINSHART"]
[null,"ELLZEE","ELLZEE",774133,7157,"",null,"SPEINSHARTER FORST"]
[null,"ELLZEE","STOFFENRIED",774133,7158,"",null,"SPIEGELAU"]
[null,"ELSENDORF","APPERSDORF",273163,6007,"",null,"ST. ENGLMAR"]
[null,"ELSENDORF","HORNECK",273163,6039,"",null,"ST. OSWALD-RIEDLHÜTT"]
[null,"ELSENDORF","MITTERSTETTEN",273163,6059,"",null,"ST. WOLFGANG"]
[null,"ELSENDORF","RATZENHOFEN",273163,6082,"",null,"STADELHOFEN"]
[null,"ELSENFELD","ELSENFELD",676121,416,"",null,"STADLERN"]
[null,"ELSENFELD","EICHELSBACH",676121,418,"",null,"STADTBERGEN"]
[null,"ELSENFELD","Rück",676121,422,"",null,"STADTLAURINGEN"]
[null,"ELSENFELD","Schippach/Els",676121,423,"",null,"STADTPROZELTEN"]
[null,"ELTMANN","LIMBACH",674133,965,"",null,"STADTSTEINACH"]
[null,"ELTMANN","ELTMANN",674133,992,"",null,"STAFFELSTEIN"]
[null,"ELTMANN","ESCHENBACH",674133,993,"",null,"STALLWANG"]
[null,"ELTMANN","ZELLER FORST-OST",674133,1010,"",null,"STAMMBACH"]
[null,"ELTMANN","DIPPACH A.MAIN",674133,1011,"",null,"STAMMHAM"]
[null,"ELTMANN","ROßSTADT",674133,1012,"",null,"STAMSRIED"]
[null,"ELTMANN","WEISBRUNN",674133,1031,"",null,"STARNBERG"]
[null,"ELTMANN","LEMBACH",674133,1032,"",null,"STARNBERGER SEE"]
[null,"EMERSACKER","EMERSACKER",772137,7221,{"$f":"+IF(A1858<>\"\",1,\"\")","v":""},null,"STAUDACH-EGERNDACH"]
[null,"EMMERING (LKR. EBE)","KRONAU",175136,8765,"",null,"STEGAURACH"]
[null,"EMMERING (LKR. EBE)","SCHALLDORF",175136,8776,"",null,"STEIN"]
[null,"EMMERING (LKR. FFB)","EMMERING",179119,8483,"",null,"STEINACH"]
[null,"EMMERTING","EMMERTING",171114,8908,"",null,"STEINACHER FORST R.D.SAALE"]
[null,"EMMERTING","ALTÖTTINGER FORST",171114,8946,"",null,"STEINACHSRANGEN"]
[null,"EMMERTING","ALZGERNER FORST",171114,8947,"",null,"STEINBACH A.WALD"]
[null,"EMMERTING","HOLZFELDER FORST",171114,8949,"",null,"STEINBERG"]
[null,"EMSKIRCHEN","EMSKIRCHEN",575121,3289,"",null,"STEINDORF"]
[null,"EMSKIRCHEN","HOHHOLZ",575121,3290,"",null,"STEINFELD"]
[null,"EMSKIRCHEN","BRUNN",575121,3291,"",null,"STEINGADEN"]
[null,"EMSKIRCHEN","ECKENBERG",575121,3292,"",null,"STEINHÖRING"]
[null,"EMSKIRCHEN","RENNHOFEN",575121,3293,"",null,"STEINKIRCHEN"]
[null,"EMSKIRCHEN","BUCHKLINGEN",575121,3294,"",null,"STEINSFELD"]
[null,"EMSKIRCHEN","SCHAUERBERG",575121,3295,"",null,"STEINWIESEN"]
[null,"EMSKIRCHEN","GUNZENDORF",575121,3296,"",null,"STEPHANSKIRCHEN"]
[null,"EMSKIRCHEN","MAUSDORF",575121,3297,"",null,"STEPHANSPOSCHING"]
[null,"EMSKIRCHEN","PIRKACH",575121,3298,"",null,"STETTEN"]
[null,"EMSKIRCHEN","NEIDHARDSWINDEN",575121,3299,"",null,"STETTFELD"]
[null,"EMSKIRCHEN","DÜRRNBUCH",575121,3300,"",null,"STIEFENHOFEN"]
[null,"EMTMANNSBERG","SCHAMELSBERG",472133,2440,"",null,"STOCKHEIM"]
[null,"EMTMANNSBERG","EMTMANNSBERG",472133,2441,"",null,"STOCKSTADT A.MAIN"]
[null,"EMTMANNSBERG","HAUENDORF",472133,2442,"",null,"STOFFENRIEDER FORST"]
[null,"EMTMANNSBERG","BIRK",472133,2443,"",null,"STOLLBERGER FORST"]
[null,"EMTMANNSBERG","FORST THIERGARTEN",472133,2469,"",null,"STÖRNSTEIN"]
[null,"ENGELSBERG","MAISENBERG",189115,9804,"",null,"STÖTTEN A.AUERBERG"]
[null,"ENGELSBERG","EITING",189115,9805,"",null,"STÖTTWANG"]
[null,"ENGELSBERG","ENGELSBERG",189115,9806,"",null,"STRAHLUNGEN"]
[null,"ENGELTHAL","ENGELTHAL",574120,3516,"",null,"STRAßKIRCHEN"]
[null,"ENGELTHAL","KRUPPACH",574120,3548,"",null,"STRAßLACH"]
[null,"ENGELTHAL","SENDELBACH",574120,3571,"",null,"STRAUBING"]
[null,"ENGELTHALER FORST","ENGELTHALER FORST",574453,3481,"",null,"STRULLENDORF"]
[null,"ENSDORF","GARSDORF",371120,4547,"",null,"STUBENBERG"]
[null,"ENSDORF","WOLFSBACH",371120,4549,"",null,"STULLN"]
[null,"ENSDORF","ENSDORF",371120,4550,"",null,"SÜDL.STEINWALD"]
[null,"ENSDORF","THANHEIM",371120,4551,"",null,"SUGENHEIM"]
[null,"ENSDORF","TAUBENBACHER FORST",371120,4564,"",null,"SULZBACH A.MAIN"]
[null,"EPPENBERG U.LEHEN","LAUENHAIN",476452,1556,"",null,"SULZBACH-ROSENBERG"]
[null,"EPPENSCHLAG","EPPENSCHLAG",272116,5811,"",null,"SULZBERG"]
[null,"EPPENSCHLAG","GROßMISSELBERG",272116,5824,"",null,"SULZDORF A.D.LEDERHE"]
[null,"EPPISHAUSEN","HASELBACH",778134,7749,"",null,"SULZEMOOS"]
[null,"EPPISHAUSEN","KÖNGHAUSEN",778134,7750,"",null,"SULZFELD"]
[null,"EPPISHAUSEN","EPPISHAUSEN",778134,7751,"",null,"SULZFELD A.MAIN"]
[null,"EPPISHAUSEN","MÖRGEN",778134,7752,"",null,"SULZFELDER FORST"]
[null,"ERBENDORF","PFABEN",377116,4133,"",null,"SULZHEIM"]
[null,"ERBENDORF","WETZLDORF",377116,4134,"",null,"SULZTHAL"]
[null,"ERBENDORF","ERBENDORF",377116,4135,"",null,"SÜNCHING"]
[null,"ERBENDORF","HAUXDORF",377116,4136,"",null,"SURBERG"]
[null,"ERBENDORF","WILDENREUTH",377116,4137,"",null,"SYRGENSTEIN"]
[null,"ERDING","ERDING",177117,8371,"",null,"TACHERTING"]
[null,"ERDING","LANGENGEISLING",177117,8372,"",null,"TACHING A.SEE"]
[null,"ERDING","ALTENERDING",177117,8380,"",null,"TAGMERSHEIM"]
[null,"ERDWEG","WELSHOFEN",174118,8553,"",null,"TANN"]
[null,"ERDWEG","KLEINBERGHOFEN",174118,8560,"",null,"TÄNNESBERG"]
[null,"ERDWEG","EISENHOFEN",174118,8611,"",null,"TAPFHEIM"]
[null,"ERDWEG","GROßBERGHOFEN",174118,8618,"",null,"TAUBERRETTERSHEIM"]
[null,"ERDWEG","UNTERWEIKERTSHOFEN",174118,8649,"",null,"TAUFKIRCHEN"]
[null,"ERESING","BEUERN",181118,9004,"",null,"TAUFKIRCHEN A.D.VILS"]
[null,"ERESING","ERESING",181118,9017,"",null,"TEGERNHEIM"]
[null,"ERGERSHEIM","ERGERSHEIM",575122,2940,"",null,"TEGERNSEE"]
[null,"ERGERSHEIM","ERMETZHOFEN",575122,2942,"",null,"TEISENDORF"]
[null,"ERGERSHEIM","NEUHERBERG",575122,2999,"",null,"TEISING"]
[null,"ERGERSHEIM","SEENHEIM",575122,3032,"",null,"TEISNACH"]
[null,"ERGOLDING","OBERGLAIM",274126,6587,"",null,"TETTAU"]
[null,"ERGOLDING","ERGOLDING",274126,6588,{"$f":"+IF(A1922<>\"\",1,\"\")","v":""},null,"TETTENWEIS"]
[null,"ERGOLDSBACH","OBERERGOLDSBACH",274127,6566,"",null,"TEUBLITZ"]
[null,"ERGOLDSBACH","LANGENHETTENBACH",274127,6572,"",null,"TEUGN"]
[null,"ERGOLDSBACH","IFFELKOFEN",274127,6573,"",null,"TEUNZ"]
[null,"ERGOLDSBACH","SIEGENSDORF",274127,6574,"",null,"TEUSCHNITZ"]
[null,"ERGOLDSBACH","ERGOLDSBACH",274127,6575,"",null,"THAINING"]
[null,"ERGOLDSBACH","PAINDLKOFEN",274127,6576,"",null,"THALMASSING"]
[null,"ERGOLDSBACH","MARTINSHAUN",274127,6578,"",null,"THALMÄSSING"]
[null,"ERHARTING","ERHARTING",183116,8823,"",null,"THANNHAUSEN"]
[null,"ERING","MÜNCHHAM",277118,6513,"",null,"THANSTEIN"]
[null,"ERING","ERING",277118,6514,"",null,"THEILENHOFEN"]
[null,"ERKHEIM","ARLESRIED",778136,7557,"",null,"THEILHEIM"]
[null,"ERKHEIM","DAXBERG",778136,7558,"",null,"THEISSEIL"]
[null,"ERKHEIM","ERKHEIM",778136,7559,"",null,"THERES"]
[null,"ERKHEIM","SCHLEGELSBERG",778136,7560,"",null,"THIERHAUPTEN"]
[null,"ERLABRUNN","ERLABRUNN",679128,665,"",null,"THIERSHEIM"]
[null,"ERLANGEN","BRUCK",562000,2760,"",null,"THIERSTEIN"]
[null,"ERLANGEN","BÜCHENBACH",562000,2765,"",null,"THUNDORF I.UFR."]
[null,"ERLANGEN","ELTERSDORF",562000,2771,"",null,"THÜNGEN"]
[null,"ERLANGEN","ERLANGEN",562000,2772,"",null,"THÜNGERSHEIM"]
[null,"ERLANGEN","FRAUENAURACH",562000,2780,"",null,"THURMANSBANG"]
[null,"ERLANGEN","GROßDECHSENDORF",562000,2786,"",null,"THURNAU"]
[null,"ERLANGEN","HÜTTENDORF",562000,2800,"",null,"THYRNAU"]
[null,"ERLANGEN","KLOSTERWALD",562000,2808,"",null,"TIEFENBACH"]
[null,"ERLANGEN","KOSBACH",562000,2809,"",null,"TIRSCHENREUTH"]
[null,"ERLANGEN","KRIEGENBRUNN",562000,2811,"",null,"TITTING"]
[null,"ERLANGEN","MÖNAU",562000,2817,"",null,"TITTLING"]
[null,"ERLANGEN","TENNENLOHE",562000,2836,"",null,"TITTMONING"]
[null,"ERLANGEN","SEBALDIFORST",562000,2853,"",null,"TODTENWEIS"]
[null,"ERLBACH","ENDLKIRCHEN",171115,8909,"",null,"TÖGING A.INN"]
[null,"ERLBACH","ERLBACH",171115,8910,"",null,"TÖPEN"]
[null,"ERLENBACH A.MAIN","ERLENBACH A.MAIN",676122,420,"",null,"TRABITZ"]
[null,"ERLENBACH A.MAIN","MECHENHARD",676122,433,"",null,"TRAIN"]
[null,"ERLENBACH A.MAIN","STREIT",676122,434,"",null,"TRAITSCHING"]
[null,"ERLENBACH B.MARKTHEI","ERLENBACH B.MARKTHEIDENFELD",677125,611,"",null,"TRAPPSTADT"]
[null,"ERLENBACH B.MARKTHEI","TIEFENTHAL",677125,612,"",null,"TRAUNREUT"]
[null,"ERLENSTEGENER FORST","ERLENSTEGENER FORST",572454,2773,"",null,"TRAUNSTEIN"]
[null,"ERMERSHAUSEN","ERMERSHAUSEN",674223,2156,"",null,"TRAUSNITZ"]
[null,"ERNSGADEN","ERNSGADEN",186116,8159,"",null,"TRAUTSKIRCHEN"]
[null,"ERNSGADEN","FEILENFORST",186116,8163,"",null,"TREBGAST"]
[null,"ESCHAU","HOBBACH",676123,419,"",null,"TREFFELSTEIN"]
[null,"ESCHAU","Sommerau",676123,424,"",null,"TREUCHTLINGEN"]
[null,"ESCHAU","OBERAULENBACH",676123,425,"",null,"TRIEFENSTEIN"]
[null,"ESCHAU","ESCHAU",676123,427,"",null,"TRIFTERN"]
[null,"ESCHAU","WILDENSEE",676123,428,"",null,"TROGEN"]
[null,"ESCHENBACH I.D.OPF.","STEGENTHUMBACH",374117,4260,"",null,"TRÖSTAU"]
[null,"ESCHENBACH I.D.OPF.","ESCHENBACH I.D.OPF.",374117,4261,"",null,"TRÖSTAUER FORST-OST"]
[null,"ESCHENBACH I.D.OPF.","THOMASREUTH",374117,4262,"",null,"TRÖSTAUER FORST-WEST"]
[null,"ESCHENLOHE","ESCHENLOHE",180114,9249,"",null,"TROSTBERG"]
[null,"ESCHLKAM","GROßAIGN",372124,5060,"",null,"TRUNKELSBERG"]
[null,"ESCHLKAM","KLEINAIGN",372124,5061,"",null,"TSCHIRN"]
[null,"ESCHLKAM","ESCHLKAM",372124,5062,"",null,"TUCHENBACH"]
[null,"ESCHLKAM","STACHESRIED",372124,5063,"",null,"TUNTENHAUSEN"]
[null,"ESCHLKAM","WARZENRIED",372124,5064,"",null,"TÜRKENFELD"]
[null,"ESCHLKAM","SCHWARZENBERG",372124,5065,"",null,"TÜRKHEIM"]
[null,"ESLARN","BURKHARDSRIETH",374118,4347,"",null,"TUSSENHAUSEN"]
[null,"ESLARN","PFRENTSCH",374118,4349,"",null,"TÜßLING"]
[null,"ESLARN","HEUMADEN",374118,4375,"",null,"TUTZING"]
[null,"ESLARN","ESLARN",374118,4382,"",null,"TYRLACHING"]
[null,"ESLARN","GMEINSRIETH",374118,4383,"",null,"ÜBERSEE"]
[null,"ESSELBACH","FÜRSTL.LÖWENSTEIN'SCHER PARK",677126,574,"",null,"ÜCHTELHAUSEN"]
[null,"ESSELBACH","STEINMARK",677126,589,"",null,"UEHLFELD"]
[null,"ESSELBACH","ESSELBACH",677126,590,"",null,"UETTINGEN"]
[null,"ESSELBACH","KREDENBACH",677126,591,"",null,"UFFENHEIM"]
[null,"ESSENBACH","MARTINSHAUN",274128,6578,{"$f":"+IF(A1986<>\"\",1,\"\")","v":""},null,"UFFING A.STAFFELSEE"]
[null,"ESSENBACH","MIRSKOFEN",274128,6589,"",null,"UNGERHAUSEN"]
[null,"ESSENBACH","OBERWATTENBACH",274128,6590,"",null,"UNGERHAUSER WALD"]
[null,"ESSENBACH","METTENBACH",274128,6591,"",null,"UNSLEBEN"]
[null,"ESSENBACH","ALTHEIM",274128,6592,"",null,"UNTERAMMERGAU"]
[null,"ESSENBACH","ESSENBACH",274128,6593,"",null,"UNTERBRUNN"]
[null,"ESSENBACH","OHU",274128,6594,"",null,"UNTERDIEßEN"]
[null,"ESSING","ALTESSING",273121,6006,"",null,"UNTERDIETFURT"]
[null,"ESSING","NEUESSING",273121,6061,"",null,"UNTEREGG"]
[null,"ESSING","RANDECK",273121,6081,"",null,"UNTERER WALD"]
[null,"ESTENFELD","MÜHLHAUSEN",679130,677,"",null,"UNTERFÖHRING"]
[null,"ESTENFELD","ESTENFELD",679130,688,"",null,"UNTERGRIESBACH"]
[null,"ESTERHOLZ","ESTERHOLZ",779453,6977,"",null,"UNTERHACHING"]
[null,"ETTAL","ETTAL",180115,9253,"",null,"UNTERLEINLEITER"]
[null,"ETTALER FORST","ETTALER FORST",180451,9254,"",null,"UNTERMEITINGEN"]
[null,"ETTENSTATT","ETTENSTATT",577127,3716,"",null,"UNTERMERZBACH"]
[null,"ETTENSTATT","REUTH UNTER NEUHAUS",577127,3717,"",null,"UNTERNEUKIRCHEN"]
[null,"ETTENSTATT","HUNDSDORF",577127,3718,"",null,"UNTERPLEICHFELD"]
[null,"ETTRINGEN","TRAUNRIED",778137,7772,"",null,"UNTERREIT"]
[null,"ETTRINGEN","SIEBNACH",778137,7773,"",null,"UNTERROGGENBURGER WALD"]
[null,"ETTRINGEN","ETTRINGEN",778137,7774,"",null,"UNTERROTH"]
[null,"ETZELWANG","SCHMIDTSTADT",371140,4478,"",null,"UNTERSCHLEIßHEIM"]
[null,"ETZELWANG","KIRCHENREINBACH",371140,4479,"",null,"UNTERSCHWANINGEN"]
[null,"ETZELWANG","NEIDSTEIN",371140,4480,"",null,"UNTERSIEMAU"]
[null,"ETZENRICHT","ETZENRICHT",374119,4389,"",null,"UNTERSTEINACH"]
[null,"ETZENRICHT","HANNERSGRÜN",374119,4392,"",null,"UNTERTHINGAU"]
[null,"ETZENRICHT","OBERWILDENAU",374119,4393,"",null,"UNTERWÖSSEN"]
[null,"EUERBACH","OBBACH",678128,869,"",null,"UNTRASRIED"]
[null,"EUERBACH","EUERBACH",678128,871,"",null,"URSBERG"]
[null,"EUERBACH","SÖMMERSDORF",678128,889,"",null,"URSENSOLLEN"]
[null,"EUERDORF","EUERDORF",672122,267,"",null,"URSPRINGEN"]
[null,"EUERDORF","WIRMSTHAL",672122,277,"",null,"USTERSBACH"]
[null,"EUERDORFER FORST","EUERDORFER FORST",672453,253,"",null,"UTTENREUTH"]
[null,"EURASBURG (LKR. AIC)","EURASBURG",771129,7363,"",null,"UTTING A.AMMERSEE"]
[null,"EURASBURG (LKR. AIC)","EURASBURGER FORST",771129,7364,"",null,"VACHENDORF"]
[null,"EURASBURG (LKR. AIC)","FREIENRIED",771129,7365,"",null,"VALLEY"]
[null,"EURASBURG (LKR. MB)","DEGERNDORF",173123,9320,"",null,"VATERSTETTEN"]
[null,"EURASBURG (LKR. MB)","EURASBURG",173123,9333,"",null,"VEITSBRONN"]
[null,"EURASBURG (LKR. MB)","HERRNHAUSEN",173123,9334,"",null,"VEITSHÖCHHEIM"]
[null,"EURASBURG (LKR. MB)","BEUERBERG",173123,9335,"",null,"VELBURG"]
[null,"EUßENHEIM","ASCHFELD",677127,545,"",null,"VELDEN"]
[null,"EUßENHEIM","EUßENHEIM",677127,546,"",null,"VELDENSTEINERFORST"]
[null,"EUßENHEIM","MÜNSTER",677127,547,"",null,"VESTENBERGSGREUTH"]
[null,"EUßENHEIM","BÜHLER",677127,548,"",null,"VIECHTACH"]
[null,"EUßENHEIM","HUNDSBACH",677127,549,"",null,"VIERETH-TRUNSTADT"]
[null,"EUßENHEIM","OBERSFELD",677127,550,"",null,"VIERKIRCHEN"]
[null,"FABRIK-SCHLEICHACHER FORST-NO","FABRIK-SCHLEICHACHER FORST-NO",674451,1025,"",null,"VILGERTSHOFEN"]
[null,"FABRIK-SCHLEICHACHER FORST-SW","FABRIK-SCHLEICHACHER FORST-SW",674452,1024,"",null,"VILLENBACH"]
[null,"FAHRENZHAUSEN","KAMMERBERG",178123,8325,"",null,"VILSBIBURG"]
[null,"FAHRENZHAUSEN","LAUTERBACH",178123,8326,"",null,"VILSECK"]
[null,"FAHRENZHAUSEN","JARZT",178123,8327,"",null,"VILSHEIM"]
[null,"FAHRENZHAUSEN","FAHRENZHAUSEN",178123,8328,"",null,"VILSHOFEN"]
[null,"FAHRENZHAUSEN","GROßNÖBACH",178123,8329,"",null,"VOGTAREUTH"]
[null,"FAHRENZHAUSEN","GÜNZENHAUSEN",178123,8333,"",null,"VOHBURG A.D.DONAU"]
[null,"FAHRENZHAUSEN","GÜNZENHAUSEN - FAHRENZHAUSEN",178123,8337,"",null,"VOHENSTRAUß"]
[null,"FALKENBERG (LKR. PAN)","FALKENBERG",277119,6412,"",null,"VÖHRINGEN"]
[null,"FALKENBERG (LKR. PAN)","FÜNFLEITEN",277119,6413,"",null,"VOLKACH"]
[null,"FALKENBERG (LKR. PAN)","HULDSESSEN",277119,6424,"",null,"VOLKENSCHWAND"]
[null,"FALKENBERG (LKR. PAN)","TAUFKIRCHEN",277119,6468,"",null,"VOLLBURG"]
[null,"FALKENBERG (LKR. PAN)","ZELL",277119,6482,"",null,"VORBACH"]
[null,"FALKENBERG (LKR. TIR)","GUMPEN",377117,4131,"",null,"VORDORFER FORST"]
[null,"FALKENBERG (LKR. TIR)","FALKENBERG",377117,4132,"",null,"VORRA"]
[null,"FALKENBERG (LKR. TIR)","HOHENWALD",377117,4148,"",null,"WAAKIRCHEN"]
[null,"FALKENBERG (LKR. TIR)","LENGENFELD B.TIRSCHENREUTH",377117,4151,"",null,"WAAL"]
[null,"FALKENBERG (LKR. TIR)","SCHÖNFICHT",377117,4163,{"$f":"+IF(A2050<>\"\",1,\"\")","v":""},null,"WACHENROTH"]
[null,"FALKENBERG (LKR. TIR)","DIEPOLTSKIRCHEN",277119,6407,"",null,"WACKERSBERG"]
[null,"FALKENFELS","FALKENFELS",278120,5578,"",null,"WACKERSDORF"]
[null,"FALKENSTEIN","AU",372125,5134,"",null,"WAFFENBRUNN"]
[null,"FALKENSTEIN","FALKENSTEIN",372125,5135,"",null,"WAGING A.SEE"]
[null,"FALKENSTEIN","ARRACH",372125,5136,"",null,"WAGINGER SEE"]
[null,"FARCHANT","FARCHANT",180116,9256,"",null,"WAIDACHER FORST"]
[null,"FAULBACH","BREITENBRUNN",676124,443,"",null,"WAIDHAUS"]
[null,"FAULBACH","FAULBACH",676124,444,"",null,"WAIDHOFEN"]
[null,"FEICHTEN A.D.ALZ","FEICHTEN A.D.ALZ",171116,8911,"",null,"WAIGOLSHAUSEN"]
[null,"FEILITZSCH","MÜNCHENREUTH",475123,1880,"",null,"WAISCHENFELD"]
[null,"FEILITZSCH","ZEDTWITZ",475123,1881,"",null,"WALD"]
[null,"FEILITZSCH","FEILITZSCH",475123,1882,"",null,"WALDASCHAFF"]
[null,"FELDAFING","TRAUBING",188118,9193,"",null,"WALDASCHAFFER FORST"]
[null,"FELDAFING","FELDAFING",188118,9194,"",null,"WALDBRUNN"]
[null,"FELDKIRCHEN (LKR. M)","FELDKIRCHEN",184118,8668,"",null,"WALDBÜTTELBRUNN"]
[null,"FELDKIRCHEN (LKR. SR)","FELDKIRCHEN",278121,5637,"",null,"WALDERBACH"]
[null,"FELDKIRCHEN (LKR. SR)","MITTERHARTHAUSEN",278121,5638,"",null,"WALDERSHOF"]
[null,"FELDKIRCHEN-WESTERHA","FELDKIRCHEN",187130,9617,"",null,"WALDFENSTERER FORST"]
[null,"FELDKIRCHEN-WESTERHA","HÖHENRAIN",187130,9636,"",null,"WALDHÄUSER WALD"]
[null,"FELDKIRCHEN-WESTERHA","VAGEN",187130,9679,"",null,"WALDKIRCHEN"]
[null,"FELLEN","Fellen",677128,506,"",null,"WALDKRAIBURG"]
[null,"FELLEN","RENGERSBRUNN",677128,508,"",null,"WALDMÜNCHEN"]
[null,"FELLHEIM","FELLHEIM",778139,7550,"",null,"WALDSASSEN"]
[null,"FENSTERBACH","HÖGLING",376125,4855,"",null,"WALDSTETTEN"]
[null,"FENSTERBACH","WOLFRING",376125,4856,"",null,"WALDTHURN"]
[null,"FENSTERBACH","DÜRNSRICHT",376125,4857,"",null,"WALKERTSHOFEN"]
[null,"FENSTERBACH","FROTZERSRICHT",376125,4858,"",null,"WALLENFELS"]
[null,"FEUCHT","FEUCHT",574123,3417,"",null,"WALLERFING"]
[null,"FEUCHT","MOOSBACH",574123,3446,"",null,"WALLERSDORF"]
[null,"FEUCHT","FEUCHTER FORST",574123,3482,"",null,"WALLERSTEIN"]
[null,"FEUCHTER FORST","FEUCHTER FORST",574454,3482,"",null,"WALLGAU"]
[null,"FEUCHTWANGEN","AICHAU",571145,2903,"",null,"WALPERTSKIRCHEN"]
[null,"FEUCHTWANGEN","AICHENZELL",571145,2904,"",null,"WALSDORF"]
[null,"FEUCHTWANGEN","BANZENWEILER",571145,2908,"",null,"WALTENHAUSEN"]
[null,"FEUCHTWANGEN","BREITENAU",571145,2916,"",null,"WALTENHOFEN"]
[null,"FEUCHTWANGEN","DORFGÜTINGEN",571145,2932,"",null,"WALTING"]
[null,"FEUCHTWANGEN","FEUCHTWANGEN",571145,2946,"",null,"WANG"]
[null,"FEUCHTWANGEN","HEILBRONN",571145,2968,"",null,"WARMENSTEINACH"]
[null,"FEUCHTWANGEN","KRAPFENAU",571145,2983,"",null,"WARMENSTEINACHER FORST-NORD"]
[null,"FEUCHTWANGEN","LARRIEDEN",571145,2987,"",null,"WARMENSTEINACHER FORST-SÜD"]
[null,"FEUCHTWANGEN","MOSBACH",571145,2998,"",null,"WARNGAU"]
[null,"FEUCHTWANGEN","THÜRNHOFEN",571145,3044,"",null,"WARTENBERG"]
[null,"FEUCHTWANGEN","VORDERBREITENTHANN",571145,3054,"",null,"WARTMANNSROTH"]
[null,"FICHTELBERG","FICHTELBERG",472138,2388,"",null,"WASSERBURG (BODENSEE"]
[null,"FICHTELBERG (GDE.FREI)","FICHTELBERG",472453,2388,"",null,"WASSERBURG A.INN"]
[null,"FICHTER U.HEID","GROßKLENAU",377452,4147,"",null,"WASSERLOSEN"]
[null,"FINNING","ENTRACHING",181120,9014,"",null,"WASSERTRÜDINGEN"]
[null,"FINNING","OBERFINNING",181120,9040,"",null,"WATTENDORF"]
[null,"FINNING","UNTERFINNING",181120,9069,"",null,"WAXENBERGER FORST-WEST"]
[null,"FINNINGEN","UNTERFINNINGEN",773150,6831,"",null,"WECHINGEN"]
[null,"FINNINGEN","OBERFINNINGEN",773150,6832,"",null,"WEGSCHEID"]
[null,"FINNINGEN","MÖRSLINGEN",773150,6833,"",null,"WEHRINGEN"]
[null,"FINSING","FINSING",177118,8397,"",null,"WEIBERSBRUNN"]
[null,"FISCHACH","FISCHACH",772141,7298,"",null,"WEICHERING"]
[null,"FISCHACH","REITENBUCH",772141,7299,"",null,"WEICHS"]
[null,"FISCHACH","ARETSRIED",772141,7300,"",null,"WEIDEN I.D.OPF."]
[null,"FISCHACH","WOLLMETSHOFEN",772141,7301,"",null,"WEIDENBACH"]
[null,"FISCHACH","WILLMATSHOFEN",772141,7302,"",null,"WEIDENBERG"]
[null,"FISCHACH","SIEGERTSHOFEN",772141,7303,"",null,"WEIDHAUSEN B.COBURG"]
[null,"FISCHACH","KREUZANGER",772141,7305,"",null,"WEIDING"]
[null,"FISCHBACH","FISCHBACH B.NÜRNBERG",574455,3418,"",null,"WEIGENDORF"]
[null,"FISCHBACHAU","NIKLASREUTH",182114,9516,"",null,"WEIGENHEIM"]
[null,"FISCHBACHAU","WÖRNSMÜHL",182114,9518,"",null,"WEIGLER"]
[null,"FISCHBACHAU","HUNDHAM",182114,9519,{"$f":"+IF(A2114<>\"\",1,\"\")","v":""},null,"WEIHENZELL"]
[null,"FISCHBACHAU","FISCHBACHAU",182114,9520,"",null,"WEIHERHAMMER"]
[null,"FISCHEN I.ALLGÄU","FISCHEN I.ALLGÄU",780121,7987,"",null,"WEIHMICHL"]
[null,"FISCHEN I.ALLGÄU","SCHÖLLANG",780121,7988,"",null,"WEIL"]
[null,"FLACHSLANDEN","FLACHSLANDEN",571146,3139,"",null,"WEILBACH"]
[null,"FLACHSLANDEN","KETTENHÖFSTETTEN",571146,3172,"",null,"WEILERSBACH"]
[null,"FLACHSLANDEN","NEUSTETTEN",571146,3198,"",null,"WEILER-SIMMERBERG"]
[null,"FLACHSLANDEN","SONDERNOHE",571146,3222,"",null,"WEILHEIM I.OB"]
[null,"FLACHSLANDEN","VIRNSBERG",571146,3231,"",null,"WEILTINGEN"]
[null,"FLADUNGEN","HUFLAR",673123,1,"",null,"WEISENDORF"]
[null,"FLADUNGEN","Leubach",673123,2,"",null,"WEISMAIN"]
[null,"FLADUNGEN","OBERFLADUNGEN",673123,3,"",null,"WEIßDORF"]
[null,"FLADUNGEN","BRÜCHS",673123,4,"",null,"WEIßENBRUNN"]
[null,"FLADUNGEN","WEIMARSCHMIEDEN",673123,5,"",null,"WEIßENBURG I.BAYERN"]
[null,"FLADUNGEN","RÜDENSCHWINDEN",673123,6,"",null,"WEIßENHORN"]
[null,"FLADUNGEN","FLADUNGEN",673123,7,"",null,"WEIßENOHE"]
[null,"FLADUNGEN","SANDS",673123,8,"",null,"WEIßENSBERG"]
[null,"FLADUNGEN","HEUFURT",673123,12,"",null,"WEIßENSTADT"]
[null,"FLINTSBACH A.INN","FLINTSBACH A.INN",187131,9618,"",null,"WEIßENSTADTER FORST-NORD"]
[null,"FLINTSBACH A.INN","NIEDERAUDORF",187131,9654,"",null,"WEIßENSTADTER FORST-SÜD"]
[null,"FLOß","SCHLATTEIN",374121,4324,"",null,"WEITNAU"]
[null,"FLOß","GAILERTSREUTH",374121,4325,"",null,"WEITRAMSDORF"]
[null,"FLOß","FLOß",374121,4326,"",null,"WELDEN"]
[null,"FLOß","KALMREUTH",374121,4327,"",null,"WELLHEIM"]
[null,"FLOß","GÖSEN",374121,4328,"",null,"WELLUCKER WALD"]
[null,"FLOß","DIEPOLTSREUTH",374121,4329,"",null,"WEMDING"]
[null,"FLOß","SCHÖNBRUNN",374121,4330,"",null,"WENDELSTEIN"]
[null,"FLOß","BERGNETSREUTH",374121,4331,"",null,"WENG"]
[null,"FLOß","GRAFENREUTH",374121,4332,"",null,"WENZENBACH"]
[null,"FLOSSENBÜRG","GÖSEN",374122,4328,"",null,"WERNBERG-KÖBLITZ"]
[null,"FLOSSENBÜRG","FLOSSENBÜRG",374122,4333,"",null,"WERNECK"]
[null,"FLÖTZ","AHORNBERG",377453,4214,"",null,"WERTACH"]
[null,"FORCHHEIM","UNTERE MARK",474126,2652,"",null,"WERTINGEN"]
[null,"FORCHHEIM","BUCKENHOFEN",474126,2653,"",null,"WEßLING"]
[null,"FORCHHEIM","FORCHHEIM",474126,2654,"",null,"WESSOBRUNN"]
[null,"FORCHHEIM","REUTH",474126,2655,"",null,"WESTENDORF"]
[null,"FORCHHEIM","BURK",474126,2656,"",null,"WESTERHEIM"]
[null,"FORCHHEIM","KERSBACH",474126,2657,"",null,"WESTERNGRUND"]
[null,"FORHEIM","FORHEIM",779146,6763,"",null,"WESTHEIM"]
[null,"FORHEIM","AUFHAUSEN",779146,6764,"",null,"WETTRINGEN"]
[null,"FORST AURA","FORST AURA",677453,503,"",null,"WETTSTETTEN"]
[null,"FORST DETTER-SÜD","FORST DETTER-SÜD",672454,235,"",null,"WEYARN"]
[null,"FORST HAIN I.SPESSART","FORST HAIN I.SPESSART",671451,365,"",null,"WIEDERGELTINGEN"]
[null,"FORST KASTEN","NEURIED",184453,8690,"",null,"WIELENBACH"]
[null,"FORST KLEINSCHWARZENLOHE","FORST KLEINSCHWARZENLOHE",576453,3825,"",null,"WIESAU"]
[null,"FORST LOHRERSTRAßE","FORST LOHRERSTRAßE",677454,551,"",null,"WIESEN"]
[null,"FORST NEUSTÄDTLEIN A.FORST","FORST NEUSTÄDTLEIN A.FORST",472454,2423,"",null,"WIESENBACH"]
[null,"FORST SANKT ZENO","FORST SANKT ZENO",172453,9953,"",null,"WIESENBRONN"]
[null,"FORST SCHMALWASSER-NORD","FORST SCHMALWASSER-NORD",673453,59,"",null,"WIESENER FORST"]
[null,"FORST SCHMALWASSER-SÜD","FORST SCHMALWASSER-SÜD",673454,76,"",null,"WIESENFELDEN"]
[null,"FORST SCHWARZENBACH A.WALD","FORST SCHWARZENBACH A.WALD",475451,1923,"",null,"WIESENT"]
[null,"FORST TENNENLOHE","FORST TENNENLOHE",572455,2778,"",null,"WIESENTHAU"]
[null,"FORST THIERGARTEN","FORST THIERGARTEN",472455,2469,"",null,"WIESENTHEID"]
[null,"FORSTENRIEDER PARK","FORSTENRIEDER PARK",184452,8717,"",null,"WIESENTTAL"]
[null,"FORSTERN","FORSTERN",177119,8410,"",null,"WIESETH"]
[null,"FORSTHOF","FORSTHOF",574456,3483,"",null,"WIESTHAL"]
[null,"FORSTINNING","FORSTINNING",175118,8758,"",null,"WIGGENSBACH"]
[null,"FORSTMÜHLER FORST","DIETERSWEG",375451,5222,"",null,"WILBURGSTETTEN"]
[null,"FORSTMÜHLER FORST","FORSTMÜHLER FORST",375451,5231,"",null,"WILDENBERG"]
[null,"FORSTWALD","FORSTWALD",676452,421,"",null,"WILDFLECKEN"]
[null,"FRAMMERSBACH","Habichsthal",677129,521,"",null,"WILDPOLDSRIED"]
[null,"FRAMMERSBACH","Frammersbach",677129,523,"",null,"WILDSTEIG"]
[null,"FRAMMERSBACHER FORST","FRAMMERSBACHER FORST",677455,522,"",null,"WILHELMSDORF"]
[null,"FRANKENWINHEIM","BRÜNNSTADT",678130,1035,"",null,"WILHELMSTHAL"]
[null,"FRANKENWINHEIM","FRANKENWINHEIM",678130,1047,{"$f":"+IF(A2178<>\"\",1,\"\")","v":""},null,"WILHERMSDORF"]
[null,"FRASDORF","FRASDORF",187132,9619,"",null,"WILLANZHEIM"]
[null,"FRASDORF","UMRATHSHAUSEN",187132,9678,"",null,"WILLMARS"]
[null,"FRASDORF","WILDENWART",187132,9683,"",null,"WILLMERING"]
[null,"FRAUENAU","FRAUENAU",276121,5746,"",null,"WINDACH"]
[null,"FRAUENBERGER/DUSCHLBERGER WALD","GRAINET",272452,5851,"",null,"WINDBERG"]
[null,"FRAUENBERGER/DUSCHLBERGER WALD","FRAUENBERG",272452,5852,"",null,"WINDELSBACH"]
[null,"FRAUENFORST","FRAUENFORST",273452,6022,"",null,"WINDISCHESCHENBACH"]
[null,"FRAUENFORST","IRLBRUNN",273452,6040,"",null,"WINDORF"]
[null,"FRAUENNEUHARTING","FRAUENNEUHARTING",175119,8759,"",null,"WINDSBACH"]
[null,"FRAUNBERG","FRAUNBERG",177120,8357,"",null,"WINHÖRING"]
[null,"FRAUNBERG","MARIA THALHEIM",177120,8358,"",null,"WINKELHAID"]
[null,"FRAUNBERG","REICHENKIRCHEN",177120,8364,"",null,"WINKELHOFER FORST"]
[null,"FREIHÖLSER FORST","DIEBIS",371453,4552,"",null,"WINKLARN"]
[null,"FREIHÖLSER FORST","PITTERSBERG",371453,4553,"",null,"WINTERBACH"]
[null,"FREIHUNG","GRESSENWÖHR",371121,4460,"",null,"WINTERHAUSEN"]
[null,"FREIHUNG","SEUGAST",371121,4461,"",null,"WINTERRIEDEN"]
[null,"FREIHUNG","TANZFLECK",371121,4462,"",null,"WINTERSTEIG"]
[null,"FREIHUNG","THANSÜß",371121,4463,"",null,"WINZER"]
[null,"FREIHUNG","FREIHUNG",371121,4464,"",null,"WINZERWALD"]
[null,"FREIHUNG","GROßSCHÖNBRUNN",371121,4475,"",null,"WIPFELD"]
[null,"FREILASSING","FREILASSING",172118,9934,"",null,"WIRSBERG"]
[null,"FREISING","HAINDLFING",178124,8315,"",null,"WITTELSHOFEN"]
[null,"FREISING","ITZLING",178124,8316,"",null,"WITTIBREUT"]
[null,"FREISING","TÜNTENHAUSEN",178124,8317,"",null,"WITTISLINGEN"]
[null,"FREISING","SÜNZHAUSEN",178124,8318,"",null,"WITZMANNSBERG"]
[null,"FREISING","HOHENBACHERN",178124,8319,"",null,"WOLFERLOHE"]
[null,"FREISING","VÖTTING",178124,8320,"",null,"WOLFERSDORF"]
[null,"FREISING","FREISING",178124,8321,"",null,"WOLFERSTADT"]
[null,"FREISING","NEUSTIFT",178124,8322,"",null,"WOLFERTSCHWENDEN"]
[null,"FREISING","PULLING",178124,8323,"",null,"WOLFRAMS-ESCHENBACH"]
[null,"FREISING","ATTACHING",178124,8324,"",null,"WOLFRATSHAUSEN"]
[null,"FREMDINGEN","FREMDINGEN",779147,6701,"",null,"WOLFRATSHAUSER FORST"]
[null,"FREMDINGEN","SCHOPFLOHE",779147,6702,"",null,"WOLFSEGG"]
[null,"FREMDINGEN","SEGLOHE",779147,6703,"",null,"WOLLBACH"]
[null,"FREMDINGEN","HAUSEN",779147,6704,"",null,"WOLNZACH"]
[null,"FREMDINGEN","HOCHALTINGEN",779147,6705,"",null,"WONFURT"]
[null,"FREMDINGEN","HERBLINGEN",779147,6706,"",null,"WONNEBERG"]
[null,"FRENSDORF","BIRKACH",471131,2111,"",null,"WONSEES"]
[null,"FRENSDORF","BIRKACHER WALD",471131,2112,"",null,"WORINGEN"]
[null,"FRENSDORF","FRENSDORF",471131,2160,"",null,"WÖRNITZ"]
[null,"FRENSDORF","HERRNSDORF",471131,2186,"",null,"WÖRTH"]
[null,"FRENSDORF","REUNDORF",471131,2267,"",null,"WÖRTH A.D.DONAU"]
[null,"FREUDENBERG","ASCHACH",371122,4519,"",null,"WÖRTH A.D.ISAR"]
[null,"FREUDENBERG","LINTACH",371122,4520,"",null,"WÖRTH A.MAIN"]
[null,"FREUDENBERG","PURSRUCK",371122,4521,"",null,"WÖRTHSEE"]
[null,"FREUDENBERG","FREUDENBERG",371122,4522,"",null,"WÜLFERSHAUSEN A.D.SA"]
[null,"FREUDENBERG","WUTSCHDORF",371122,4523,"",null,"WUNSIEDEL"]
[null,"FREUDENBERG","HILTERSDORF",371122,4540,"",null,"WURMANNSQUICK"]
[null,"FREUDENBERG","ETSDORF",371122,4541,"",null,"WURMSHAM"]
[null,"FREYSTADT","AßLSCHWANG",373126,4602,"",null,"WÜRZBURG"]
[null,"FREYSTADT","BURGGRIESBACH",373126,4609,"",null,"WUSTVIELER FORST"]
[null,"FREYSTADT","FORCHHEIM",373126,4618,"",null,"ZACHENBERG"]
[null,"FREYSTADT","FREYSTADT",373126,4620,"",null,"ZANDT"]
[null,"FREYSTADT","GROßBERGHAUSEN",373126,4626,"",null,"ZANGBERG"]
[null,"FREYSTADT","HÖFEN",373126,4634,"",null,"ZAPFENDORF"]
[null,"FREYSTADT","LAUTERBACH",373126,4640,"",null,"ZEIL A.MAIN"]
[null,"FREYSTADT","MICHELBACH",373126,4648,"",null,"ZEILARN"]
[null,"FREYSTADT","MÖNING",373126,4651,"",null,"ZEITLARN"]
[null,"FREYSTADT","MÖRSDORF",373126,4652,"",null,"ZEITLOFS"]
[null,"FREYSTADT","OBERNDORF",373126,4658,"",null,"ZELL"]
[null,"FREYSTADT","SCHMELLNRICHT",373126,4681,"",null,"ZELL A.MAIN"]
[null,"FREYSTADT","SONDERSFELD",373126,4686,"",null,"ZELLER FORST-WEST"]
[null,"FREYSTADT","SULZKIRCHEN",373126,4692,"",null,"ZELLINGEN"]
[null,"FREYSTADT","THANNHAUSEN",373126,4694,{"$f":"+IF(A2242<>\"\",1,\"\")","v":""},null,"ZENTING"]
[null,"FREYSTADT","THUNDORF",373126,4695,"",null,"ZERZABELSHOFER FORST"]
[null,"FREYUNG","ORT-WOLFSTEIN",272118,5801,"",null,"ZIEMETSHAUSEN"]
[null,"FREYUNG","KREUZBERG",272118,5819,"",null,"ZIERTHEIM"]
[null,"FREYUNG","KUMREUT",272118,5844,"",null,"ZIRNDORF"]
[null,"FREYUNG","AHORNÖD",272118,5845,"",null,"ZOLLING"]
[null,"FREYUNG","ORT",272118,5846,"",null,"ZORNEDING"]
[null,"FREYUNG","FREYUNG",272118,5847,"",null,"ZÖSCHINGEN"]
[null,"FREYUNG","WOLFSTEIN",272118,5848,"",null,"ZÜCKSHUTER FORST"]
[null,"FREYUNG","HARSDORF",272118,5862,"",null,"ZUSAMALTHEIM"]
[null,"FRICKENHAUSEN A.MAIN","FRICKENHAUSEN A.MAIN",679131,745,"",null,"ZUSMARSHAUSEN"]
[null,"FRIDOLFING","PIETLING",189118,9911,"",null,"ZWIESEL"]
[null,"FRIDOLFING","FRIDOLFING",189118,9912,""]
[null,"FRIEDBERG","DERCHING",771130,7366,""]
[null,"FRIEDBERG","DERCHINGER FORST",771130,7367,""]
[null,"FRIEDBERG","STÄTZLING",771130,7368,""]
[null,"FRIEDBERG","HABERSKIRCH",771130,7369,""]
[null,"FRIEDBERG","WULFERTSHAUSEN",771130,7370,""]
[null,"FRIEDBERG","FRIEDBERG",771130,7371,""]
[null,"FRIEDBERG","WIFFERTSHAUSEN",771130,7372,""]
[null,"FRIEDBERG","PAAR",771130,7373,""]
[null,"FRIEDBERG","HARTHAUSEN",771130,7374,""]
[null,"FRIEDBERG","REDERZHAUSEN",771130,7375,""]
[null,"FRIEDBERG","OTTMARING",771130,7376,""]
[null,"FRIEDBERG","RINNENTHAL",771130,7377,""]
[null,"FRIEDBERG","ROHRBACH",771130,7379,""]
[null,"FRIEDBERG","BACHERN",771130,7380,""]
[null,"FRIEDENFELS","BÄRNHÖHE",377118,4128,""]
[null,"FRIEDENFELS","FRIEDENFELS",377118,4129,""]
[null,"FRIEDENFELS","VOITENTHAN",377118,4130,""]
[null,"FRIESENRIED","BLÖCKTACH",777128,7841,""]
[null,"FRIESENRIED","FRIESENRIED",777128,7842,""]
[null,"FRONTENHAUSEN","FRONTENHAUSEN",279115,6165,""]
[null,"FRONTENHAUSEN","RAMPOLDSTETTEN",279115,6168,""]
[null,"FUCHSMÜHL","FUCHSMÜHL",377119,4125,""]
[null,"FUCHSMÜHL","VOITENTHAN",377119,4130,""]
[null,"FUCHSSTADT","FUCHSSTADT",672124,293,""]
[null,"FUCHSTAL","ASCH",181121,9002,""]
[null,"FUCHSTAL","LEEDER",181121,9034,""]
[null,"FUCHSTAL","SEESTALL",181121,9063,""]
[null,"FUCHSTAL","KINGHOLZ",181121,9079,""]
[null,"FÜNFSTETTEN","NUßBÜHL",779148,6905,""]
[null,"FÜNFSTETTEN","FÜNFSTETTEN",779148,6906,""]
[null,"FÜRSTENECK","FÜRSTENECK",272119,5871,""]
[null,"FÜRSTENFELDBRUCK","MALCHING",179121,8458,""]
[null,"FÜRSTENFELDBRUCK","FÜRSTENFELDBRUCK",179121,8480,""]
[null,"FÜRSTENFELDBRUCK","AICH",179121,8481,""]
[null,"FÜRSTENFELDBRUCK","PUCH",179121,8482,""]
[null,"FÜRSTENSTEIN","FÜRSTENSTEIN",275121,6301,""]
[null,"FÜRSTENZELL","VOGLARN",275122,6357,""]
[null,"FÜRSTENZELL","ALTENMARKT",275122,6358,""]
[null,"FÜRSTENZELL","FÜRSTENZELL",275122,6359,""]
[null,"FÜRSTENZELL","BAD HÖHENSTADT",275122,6360,""]
[null,"FÜRSTENZELL","ENGERTSHAM",275122,6361,""]
[null,"FÜRSTL.LÖWENSTEIN'SCHER PARK","FÜRSTL.LÖWENSTEIN'SCHER PARK",677456,574,""]
[null,"FURTH","SCHATZHOFEN",274132,6584,""]
[null,"FURTH","FURTH",274132,6585,""]
[null,"FURTH","ARTH",274132,6586,""]
[null,"FÜRTH","FÜRTH",563000,3335,""]
[null,"FÜRTH","VACH",563000,3336,""]
[null,"FÜRTH","STADELN",563000,3337,""]
[null,"FÜRTH","SACK",563000,3338,""]
[null,"FÜRTH","BURGFARRNBACH",563000,3339,""]
[null,"FÜRTH","UNTERFARRNBACH",563000,3340,""]
[null,"FÜRTH","RONHOF",563000,3341,{"$f":"+IF(A2306<>\"\",1,\"\")","v":""}]
[null,"FÜRTH","POPPENREUTH",563000,3342,""]
[null,"FÜRTH","FÜRTHER STADTWALD",563000,3343,""]
[null,"FÜRTH","DAMBACH",563000,3344,""]
[null,"FURTH I.WALD","HERZOGAU",372126,5024,""]
[null,"FURTH I.WALD","LIXENRIED",372126,5055,""]
[null,"FURTH I.WALD","GRABITZ",372126,5056,""]
[null,"FURTH I.WALD","FURTH IM WALD",372126,5057,""]
[null,"FURTH I.WALD","RÄNKAM",372126,5058,""]
[null,"FURTH I.WALD","SENGENBÜHL",372126,5059,""]
[null,"FÜSSEN","HOPFEN AM SEE",777129,7912,""]
[null,"FÜSSEN","ESCHACH",777129,7913,""]
[null,"FÜSSEN","WEIßENSEE",777129,7914,""]
[null,"FÜSSEN","FÜSSEN",777129,7915,""]
[null,"GABLINGEN","GABLINGEN",772145,7230,""]
[null,"GABLINGEN","LÜTZELBURG",772145,7231,""]
[null,"GACHENBACH","UNTERWEILENBACH",185131,8116,""]
[null,"GACHENBACH","PEUTENHAUSEN",185131,8117,""]
[null,"GACHENBACH","GACHENBACH",185131,8118,""]
[null,"GACHENBACH","WEILACH",185131,8119,""]
[null,"GACHENBACH","SATTELBERG",185131,8120,""]
[null,"GÄDHEIM","GÄDHEIM",674139,915,""]
[null,"GÄDHEIM","GREßHAUSEN",674139,916,""]
[null,"GÄDHEIM","OTTENDORF",674139,937,""]
[null,"GAIMERSHEIM","LIPPERTSHOFEN",176126,8027,""]
[null,"GAIMERSHEIM","GAIMERSHEIM",176126,8028,""]
[null,"GAIßACH","GAIßACH",173124,9412,""]
[null,"GALLMERSGARTEN","GALLMERSGARTEN",575124,2950,""]
[null,"GALLMERSGARTEN","MÖRLBACH",575124,2997,""]
[null,"GALLMERSGARTEN","STEINACH A.D.ENS",575124,3037,""]
[null,"GAMMELSDORF","GAMMELSDORF",178125,8270,""]
[null,"GAMMELSDORF","ENGHAUSEN",178125,8272,""]
[null,"GAMMELSDORF","REICHERSDORF",178125,8273,""]
[null,"GANGKOFEN","GANGKOFEN",277121,6415,""]
[null,"GANGKOFEN","KOLLBACH",277121,6429,""]
[null,"GANGKOFEN","MALLING",277121,6437,""]
[null,"GANGKOFEN","OBERTRENNBACH",277121,6447,""]
[null,"GANGKOFEN","PANZING",277121,6448,""]
[null,"GANGKOFEN","REICHENEIBACH",277121,6455,""]
[null,"GANGKOFEN","SALLACH",277121,6461,""]
[null,"GANGKOFEN","DIRNAICH",277121,6485,""]
[null,"GANGKOFEN","HÖLSBRUNN",277121,6486,""]
[null,"GANGKOFEN","ANGERBACH",277121,6488,""]
[null,"GANGKOFEN","SCHÖFTHAL",277121,6489,""]
[null,"GARCHING A.D.ALZ","GARCHING A.D.ALZ",171117,8913,""]
[null,"GARCHING A.D.ALZ","WALD A.D.ALZ",171117,8943,""]
[null,"GARCHING B.MÜNCHEN","GARCHING B.MÜNCHEN",184119,8672,""]
[null,"GARMISCH-PARTENKIRCH","GARMISCH",180117,9259,""]
[null,"GARMISCH-PARTENKIRCH","PARTENKIRCHEN",180117,9260,""]
[null,"GARMISCH-PARTENKIRCH","BERGWERK",180117,9263,""]
[null,"GARS A.INN","GARS A.INN",183118,9721,""]
[null,"GARS A.INN","LENGMOOS",183118,9722,""]
[null,"GARS A.INN","KLOSTERGARS",183118,9723,""]
[null,"GARS A.INN","MITTERGARS",183118,9724,""]
[null,"GARS A.INN","AU A.INN",183118,9725,""]
[null,"GATTENDORF","GATTENDORF",475127,1884,""]
[null,"GATTENDORF","LEIMITZ",475127,1885,""]
[null,"GATTENDORF","HAIDT",475127,1886,""]
[null,"GAUKÖNIGSHOFEN","ACHOLSHAUSEN",679134,741,""]
[null,"GAUKÖNIGSHOFEN","GAUKÖNIGSHOFEN",679134,750,""]
[null,"GAUKÖNIGSHOFEN","EICHELSEE",679134,751,""]
[null,"GAUKÖNIGSHOFEN","WOLKSHAUSEN",679134,756,""]
[null,"GAUKÖNIGSHOFEN","RITTERSHAUSEN",679134,757,""]
[null,"GAUTING","UNTERBRUNN",188120,9163,""]
[null,"GAUTING","GAUTING",188120,9164,{"$f":"+IF(A2370<>\"\",1,\"\")","v":""}]
[null,"GAUTING","BUCHENDORF",188120,9165,""]
[null,"GAUTING","OBERBRUNN",188120,9167,""]
[null,"GDE.FREI (LKR. A)","STREITHEIM",772444,7245,""]
[null,"GDE.FREI (LKR. A)","HORGAUERGREUT",772444,7248,""]
[null,"GDE.FREI (LKR. AS)","ROTHENBRUCK - GEMEINDEFREI",371444,3589,""]
[null,"GDE.FREI (LKR. AS)","HOLZHAMMER",371444,4494,""]
[null,"GDE.FREI (LKR. AS)","ROSENBERG",371444,4499,""]
[null,"GDE.FREI (LKR. AS)","ASCHACH",371444,4519,""]
[null,"GDE.FREI (LKR. AS)","LEITEN U.SCHOTTENBÜHL",371444,4528,""]
[null,"GDE.FREI (LKR. AS)","ETSDORF",371444,4541,""]
[null,"GDE.FREI (LKR. BA)","BURGHOLZ",471444,2128,""]
[null,"GDE.FREI (LKR. BA)","GRUMBACH",471444,2173,""]
[null,"GDE.FREI (LKR. BT)","KIRCHENPINGARTEN",472444,2455,""]
[null,"GDE.FREI (LKR. BT)","LANGWEILER WALD - GEMEINDEFREI",472444,2557,""]
[null,"GDE.FREI (LKR. EI)","KÖSCHINGER FORST",176444,8019,""]
[null,"GDE.FREI (LKR. HAS)","ROTTENSTEINER FORST",674444,811,""]
[null,"GDE.FREI (LKR. HAS)","GOßMANNSDORFER FORST",674444,853,""]
[null,"GDE.FREI (LKR. KC)","TETTAU",476444,1557,""]
[null,"GDE.FREI (LKR. KC)","LANGENAU",476444,1560,""]
[null,"GDE.FREI (LKR. KC)","FRIEDERSDORF",476444,1572,""]
[null,"GDE.FREI (LKR. KC)","NURN",476444,1593,""]
[null,"GDE.FREI (LKR. KC)","STEINWIESEN",476444,1595,""]
[null,"GDE.FREI (LKR. KG)","OBERBACH",672444,160,""]
[null,"GDE.FREI (LKR. KG)","SALZFORST",672444,170,""]
[null,"GDE.FREI (LKR. KG)","RUPBODENER FORST",672444,195,""]
[null,"GDE.FREI (LKR. KG)","FORST DETTER-NORD",672444,196,""]
[null,"GDE.FREI (LKR. LIF)","LANGHEIM",478444,1398,""]
[null,"GDE.FREI (LKR. MSP)","NEUHÜTTEN",677444,534,""]
[null,"GDE.FREI (LKR. NES)","STEINACH",673444,179,""]
[null,"GDE.FREI (LKR. NEW)","KLOBENREUTH",374444,4314,""]
[null,"GDE.FREI (LKR. NEW)","SCHLATTEIN",374444,4324,""]
[null,"GDE.FREI (LKR. NEW)","BERNRIETH",374444,4337,""]
[null,"GDE.FREI (LKR. NEW)","PLEYSTEIN",374444,4345,""]
[null,"GDE.FREI (LKR. NEW)","LOHMA",374444,4346,""]
[null,"GDE.FREI (LKR. NEW)","ALTENSTADT A.D.WALDNAAB",374444,4354,""]
[null,"GDE.FREI (LKR. PA)","UTTLAU",275444,6367,""]
[null,"GDE.FREI (LKR. RH)","FISCHBACH - GEMEINDEFREI",574444,3488,""]
[null,"GDE.FREI (LKR. SAD)","LANZENRIED",376444,4775,""]
[null,"GDE.FREI (LKR. STA)","WADLHAUSER GRÄBEN",188444,9187,""]
[null,"GDE.FREI (LKR. TIR)","FALKENBERG",377444,4132,""]
[null,"GDE.FREI (LKR. WUN)","HALLERSTEINER FORST-SÜD",479444,2025,""]
[null,"GEBENBACH","GEBENBACH",371123,4488,""]
[null,"GEBSATTEL","BOCKENFELD",571152,2914,""]
[null,"GEBSATTEL","GEBSATTEL",571152,2953,""]
[null,"GEBSATTEL","KIRNBERG",571152,2981,""]
[null,"GEFREES","STREITAU",472139,2351,""]
[null,"GEFREES","ZETTLITZ",472139,2352,""]
[null,"GEFREES","FALLS",472139,2353,""]
[null,"GEFREES","WITZLESHOFEN",472139,2354,""]
[null,"GEFREES","WUNDENBACH",472139,2355,""]
[null,"GEFREES","GEFREES",472139,2356,""]
[null,"GEFREES","KORNBACH",472139,2357,""]
[null,"GEFREES","LÜTZENREUTH",472139,2358,""]
[null,"GEFREES","GRÜNSTEIN",472139,2359,""]
[null,"GEFREES","METZLERSREUTH",472139,2360,""]
[null,"GEIERSBERG","OBERSCHWARZACH",678452,1058,""]
[null,"GEIERSNEST-OST","GEIERSNEST-OST",672455,227,""]
[null,"GEIERSNEST-WEST","GEIERSNEST-WEST",672456,219,""]
[null,"GEIERSTHAL","GEIERSTHAL",276122,5724,""]
[null,"GEISBERGER FORST","GEISBERGER FORST",471454,2163,""]
[null,"GEISELBACH","GEISELBACHER FORST",671119,301,""]
[null,"GEISELBACH","GEISELBACH",671119,303,""]
[null,"GEISELBACH","OMERSBACH",671119,310,""]
[null,"GEISELBACHER FORST","GEISELBACHER FORST",671452,301,{"$f":"+IF(A2434<>\"\",1,\"\")","v":""}]
[null,"GEISELHÖRING","WALLKOFEN",278123,5632,""]
[null,"GEISELHÖRING","GEISELHÖRING",278123,5633,""]
[null,"GEISELHÖRING","HIRSCHLING",278123,5634,""]
[null,"GEISELHÖRING","OBERHARTHAUSEN",278123,5635,""]
[null,"GEISELHÖRING","PÖNNING",278123,5636,""]
[null,"GEISELHÖRING","SALLACH",278123,5650,""]
[null,"GEISELHÖRING","HAINSBACH",278123,5651,""]
[null,"GEISELWIND","GRÄFENNEUSES",675127,1146,""]
[null,"GEISELWIND","EBERSBRUNN",675127,1147,""]
[null,"GEISELWIND","LANGENBERG",675127,1158,""]
[null,"GEISELWIND","GEISELWIND",675127,1159,""]
[null,"GEISELWIND","FÜTTERSEE",675127,1160,""]
[null,"GEISELWIND","ILMENAU",675127,1161,""]
[null,"GEISELWIND","BURGGRUB",675127,1162,""]
[null,"GEISELWIND","HOLZBERNDORF",675127,1163,""]
[null,"GEISELWIND","REHWEILER",675127,1174,""]
[null,"GEISELWIND","DÜRRNBUCH",675127,1175,""]
[null,"GEISELWIND","WASSERBERNDORF",675127,1176,""]
[null,"GEISELWIND","FREIHASLACH",675127,1178,""]
[null,"GEISELWIND","FREIHASLACH NORDWEST",675127,1256,""]
[null,"GEISENFELD","GEISENFELD",186122,8160,""]
[null,"GEISENFELD","ILMENDORF",186122,8161,""]
[null,"GEISENFELD","NÖTTING",186122,8162,""]
[null,"GEISENFELD","FEILENFORST",186122,8163,""]
[null,"GEISENFELD","GEISENFELDWINDEN",186122,8164,""]
[null,"GEISENFELD","PARLEITEN",186122,8165,""]
[null,"GEISENFELD","SCHILLWITZRIED",186122,8166,""]
[null,"GEISENFELD","ENGELBRECHTSMÜNSTER",186122,8167,""]
[null,"GEISENFELD","GADEN B.GEISENFELD",186122,8168,""]
[null,"GEISENFELD","ZELL",186122,8169,""]
[null,"GEISENFELD","UNTERPINDHART",186122,8170,""]
[null,"GEISENFELD","UNTERMETTENBACH",186122,8171,""]
[null,"GEISENFELD","ROTTENEGG",186122,8172,""]
[null,"GEISENHAUSEN","SALKSDORF",274134,6654,""]
[null,"GEISENHAUSEN","DIEMANNSKIRCHEN",274134,6655,""]
[null,"GEISENHAUSEN","GEISENHAUSEN",274134,6656,""]
[null,"GEISENHAUSEN","HOLZHAUSEN",274134,6657,""]
[null,"GEISENHAUSEN","BERGHAM",274134,6658,""]
[null,"GELCHSHEIM","OSTHAUSEN",679135,762,""]
[null,"GELCHSHEIM","GELCHSHEIM",679135,766,""]
[null,"GELCHSHEIM","OELLINGEN",679135,767,""]
[null,"GELDERSHEIM","GELDERSHEIM",678132,890,""]
[null,"GELLNHAUSEN","GELLNHAUSEN",473453,1355,""]
[null,"GELTENDORF","GELTENDORF",181122,9019,""]
[null,"GELTENDORF","HAUSEN B.GELTENDORF",181122,9023,""]
[null,"GELTENDORF","KALTENBERG",181122,9030,""]
[null,"GELTENDORF","WALLESHAUSEN",181122,9075,""]
[null,"GEMÜNDEN A.MAIN","Schaippach",677131,511,""]
[null,"GEMÜNDEN A.MAIN","ASCHENROTH",677131,517,""]
[null,"GEMÜNDEN A.MAIN","SEIFRIEDSBURG",677131,519,""]
[null,"GEMÜNDEN A.MAIN","LANGENPROZELTEN",677131,528,""]
[null,"GEMÜNDEN A.MAIN","HOFSTETTEN",677131,529,""]
[null,"GEMÜNDEN A.MAIN","GEMÜNDEN A.MAIN",677131,530,""]
[null,"GEMÜNDEN A.MAIN","MASSENBUCH",677131,539,""]
[null,"GEMÜNDEN A.MAIN","WERNFELD",677131,540,""]
[null,"GEMÜNDEN A.MAIN","HARRBACH",677131,541,""]
[null,"GEMÜNDEN A.MAIN","ADELSBERG",677131,542,""]
[null,"GENDERKINGEN","GENDERKINGEN",779149,6959,""]
[null,"GEORGENBERG","BERNRIETH",374123,4337,""]
[null,"GEORGENBERG","WALDKIRCH",374123,4338,""]
[null,"GEORGENBERG","NEUDORF",374123,4339,""]
[null,"GEORGENBERG","GEORGENBERG",374123,4340,""]
[null,"GEORGENBERG","DIMPFL",374123,4341,""]
[null,"GEORGENBERG","BRÜNST",374123,4342,{"$f":"+IF(A2498<>\"\",1,\"\")","v":""}]
[null,"GEORGENBERG","REINHARDSRIETH",374123,4343,""]
[null,"GEORGENSGMÜND","GEORGENSGMÜND",576121,3827,""]
[null,"GEORGENSGMÜND","MÄBENBERG",576121,3863,""]
[null,"GEORGENSGMÜND","OBERSTEINBACH OB GMÜND",576121,3871,""]
[null,"GEORGENSGMÜND","PETERSGMÜND",576121,3878,""]
[null,"GEORGENSGMÜND","RITTERSBACH",576121,3887,""]
[null,"GEORGENSGMÜND","WALLESAU",576121,3909,""]
[null,"GERACH","GERACH",471133,2165,""]
[null,"GERACH","LUßBERGER FORST",471133,2221,""]
[null,"GERATSKIRCHEN","GERATSKIRCHEN",277122,6416,""]
[null,"GERBRUNN","GERBRUNN",679136,708,""]
[null,"GERETSRIED","GELTING",173126,9323,""]
[null,"GERETSRIED","GERETSRIED",173126,9324,""]
[null,"GERHARDSHOFEN","REINHARDSHOFEN",575125,3263,""]
[null,"GERHARDSHOFEN","GERHARDSHOFEN",575125,3277,""]
[null,"GERHARDSHOFEN","BIRNBAUM",575125,3278,""]
[null,"GERHARDSHOFEN","KÄSTEL",575125,3279,""]
[null,"GERHARDSHOFEN","WILLMERSBACH",575125,3280,""]
[null,"GERHARDSHOFEN","GÖTTELHÖF",575125,3281,""]
[null,"GERLASER FORST","GERLASER FORST",475452,1984,""]
[null,"GERMARINGEN","KETTERSCHWANG",777130,7847,""]
[null,"GERMARINGEN","UNTERGERMARINGEN",777130,7848,""]
[null,"GERMARINGEN","OBERGERMARINGEN",777130,7849,""]
[null,"GERMERING","GERMERING",179123,8501,""]
[null,"GERMERING","UNTERPFAFFENHOFEN",179123,8502,""]
[null,"GERODA","GERODA",672126,177,""]
[null,"GERODA","PLATZ",672126,187,""]
[null,"GEROLDSGRÜN","GEROLDSGRÜN",475128,1851,""]
[null,"GEROLDSGRÜN","DÜRRENWAID",475128,1852,""]
[null,"GEROLDSGRÜN","STEINBACH B.GEROLDSGRÜN",475128,1853,""]
[null,"GEROLDSGRÜN","LANGENBACH",475128,1854,""]
[null,"GEROLDSGRÜN","GEROLDSGRÜNER FORST",475128,1985,""]
[null,"GEROLDSGRÜNER FORST","GEROLDSGRÜNER FORST",475453,1985,""]
[null,"GEROLDSHAUSEN","MOOS",679137,730,""]
[null,"GEROLDSHAUSEN","GEROLDSHAUSEN",679137,731,""]
[null,"GEROLFINGEN","GEROLFINGEN",571154,3667,""]
[null,"GEROLFINGEN","AUFKIRCHEN",571154,3668,""]
[null,"GEROLFINGEN","IRSINGEN",571154,3669,""]
[null,"GEROLSBACH","STROBENRIED",186125,8214,""]
[null,"GEROLSBACH","GEROLSBACH",186125,8215,""]
[null,"GEROLSBACH","SINGENBACH",186125,8216,""]
[null,"GEROLSBACH","KLENAU",186125,8217,""]
[null,"GEROLSBACH","ALBERZELL",186125,8218,""]
[null,"GEROLZHOFEN","GEROLZHOFEN",678134,1036,""]
[null,"GEROLZHOFEN","RÜGSHOFEN",678134,1037,""]
[null,"GERSTHOFEN","GERSTHOFEN",772147,7232,""]
[null,"GERSTHOFEN","BATZENHOFEN",772147,7233,""]
[null,"GERSTHOFEN","RETTENBERGEN",772147,7234,""]
[null,"GERSTHOFEN","EDENBERGEN",772147,7235,""]
[null,"GERSTHOFEN","HIRBLINGEN",772147,7236,""]
[null,"GERZEN","JESENDORF",274135,6627,""]
[null,"GERZEN","LICHTENHAAG",274135,6628,""]
[null,"GERZEN","GERZEN",274135,6629,""]
[null,"GESCHAIDT","GESCHAIDT",572456,2783,""]
[null,"GESCHAIDT","HEROLDSBERG",572456,2794,""]
[null,"GESEES","FORKENDORF",472140,2463,""]
[null,"GESEES","GESEES",472140,2464,""]
[null,"GESLAU","DORNHAUSEN",571155,2933,""]
[null,"GESLAU","GESLAU",571155,2956,""]
[null,"GESLAU","GUNZENDORF",571155,2961,""]
[null,"GESLAU","SCHWABSROTH",571155,3029,""]
[null,"GESLAU","STETTBERG",571155,3038,""]
[null,"GESSERTSHAUSEN","GESSERTSHAUSEN",772148,7269,""]
[null,"GESSERTSHAUSEN","DEUBACH",772148,7270,{"$f":"+IF(A2562<>\"\",1,\"\")","v":""}]
[null,"GESSERTSHAUSEN","WOLLISHAUSEN",772148,7271,""]
[null,"GESSERTSHAUSEN","MARGERTSHAUSEN",772148,7272,""]
[null,"GESSERTSHAUSEN","DÖPSHOFEN",772148,7273,""]
[null,"GESTRATZ","GESTRATZ",776112,7954,""]
[null,"GIEBELSTADT","SULZDORF",679138,733,""]
[null,"GIEBELSTADT","INGOLSTADT I.UFR.",679138,734,""]
[null,"GIEBELSTADT","EßFELD",679138,735,""]
[null,"GIEBELSTADT","GIEBELSTADT",679138,740,""]
[null,"GIEBELSTADT","ALLERSHEIM",679138,748,""]
[null,"GIEBELSTADT","HERCHSHEIM",679138,749,""]
[null,"GIEBELSTADT","EUERHAUSEN",679138,755,""]
[null,"GILCHING","GILCHING",188121,9151,""]
[null,"GILCHING","ARGELSRIED",188121,9152,""]
[null,"GLASHÜTTEN","GLASHÜTTEN",472141,2416,""]
[null,"GLASHÜTTEN","GLASHÜTTENER FORST",472141,2483,""]
[null,"GLASHÜTTENER FORST","GLASHÜTTENER FORST",472456,2483,""]
[null,"GLATTBACH","GLATTBACH",671120,354,""]
[null,"GLEIRITSCH","BERNHOF",376131,4818,""]
[null,"GLEIRITSCH","GLEIRITSCH",376131,4819,""]
[null,"GLEIßENBERG","GLEIßENBERG",372128,5047,""]
[null,"GLONN","GLONN",175121,8761,""]
[null,"GLÖTT","GLÖTT",773133,6894,""]
[null,"GMUND A.TEGERNSEE","DÜRNBACH",182116,9421,""]
[null,"GMUND A.TEGERNSEE","GMUND A.TEGERNSEE",182116,9422,""]
[null,"GNOTZHEIM","GNOTZHEIM",577133,3639,""]
[null,"GOCHSHEIM","WEYER",678135,913,""]
[null,"GOCHSHEIM","GOCHSHEIM",678135,934,""]
[null,"GOLDBACH","UNTERAFFERBACH",671121,355,""]
[null,"GOLDBACH","GOLDBACH",671121,363,""]
[null,"GOLDKRONACH","LEISAU",472143,2378,""]
[null,"GOLDKRONACH","BRANDHOLZ",472143,2379,""]
[null,"GOLDKRONACH","GOLDKRONACH",472143,2380,""]
[null,"GOLDKRONACH","DRESSENDORF",472143,2381,""]
[null,"GOLDKRONACH","NEMMERSDORF",472143,2382,""]
[null,"GOLDKRONACHER FORST","GOLDKRONACHER FORST",472457,2383,""]
[null,"GOLLHOFEN","GOLLACHOSTHEIM",575127,2957,""]
[null,"GOLLHOFEN","GOLLHOFEN",575127,2958,""]
[null,"GÖRISRIED","GÖRISRIED",777131,7882,""]
[null,"GÖSSENHEIM","SACHSENHEIM",677132,543,""]
[null,"GÖSSENHEIM","GÖSSENHEIM",677132,544,""]
[null,"GÖßWEINSTEIN","UNTERAILSFELD",474129,2638,""]
[null,"GÖßWEINSTEIN","BEHRINGERSMÜHLE",474129,2639,""]
[null,"GÖßWEINSTEIN","GÖßWEINSTEIN",474129,2640,""]
[null,"GÖßWEINSTEIN","STADELHOFEN",474129,2641,""]
[null,"GÖßWEINSTEIN","LEUTZDORF",474129,2642,""]
[null,"GÖßWEINSTEIN","MORSCHREUTH",474129,2643,""]
[null,"GÖßWEINSTEIN","WICHSENSTEIN",474129,2644,""]
[null,"GÖßWEINSTEIN","KLEINGESEE",474129,2645,""]
[null,"GOTTESZELL","GOTTESZELL",276123,5738,""]
[null,"GOTTFRIEDING","GOTTFRIEDING",279116,6178,""]
[null,"GOTTFRIEDING","HACKERSKOFEN",279116,6179,""]
[null,"GRABEN","GRABEN",772149,7332,""]
[null,"GRABENSTÄTT","GRABENSTÄTT",189119,9845,""]
[null,"GRABENSTÄTT","OBERHOCHSTÄTT",189119,9846,""]
[null,"GRABENSTÄTT","ERLSTÄTT",189119,9847,""]
[null,"GRABENSTÄTT","HOLZHAUSEN",189119,9862,""]
[null,"GRÄFELFING","GRÄFELFING",184120,8673,""]
[null,"GRAFENAU","GROßARMSCHLAG",272120,5813,""]
[null,"GRAFENAU","ROSENAU",272120,5814,""]
[null,"GRAFENAU","GRAFENAU",272120,5815,""]
[null,"GRAFENAU","NEUDORF",272120,5816,""]
[null,"GRAFENAU","BÄRNSTEIN",272120,5826,""]
[null,"GRAFENAU","SCHLAG",272120,5827,""]
[null,"GRAFENAU","LIEBERSBERG",272120,5835,{"$f":"+IF(A2626<>\"\",1,\"\")","v":""}]
[null,"GRAFENAU","NENDLNACH",272120,5840,""]
[null,"GRAFENAU","HAUS I.WALD",272120,5841,""]
[null,"GRAFENAU","HEINRICHSREIT",272120,5842,""]
[null,"GRÄFENBERG","THUISBRUNN",474132,2689,""]
[null,"GRÄFENBERG","WALKERSBRUNN",474132,2690,""]
[null,"GRÄFENBERG","GRÄFENBERG",474132,2691,""]
[null,"GRÄFENBERG","GUTTENBURG",474132,2692,""]
[null,"GRÄFENBERG","LILLING",474132,2693,""]
[null,"GRAFENBUCHER FORST","GRAFENBUCHER FORST",373451,4624,""]
[null,"GRÄFENDORF","Wolfsmünster",677133,512,""]
[null,"GRÄFENDORF","Schonderfeld",677133,513,""]
[null,"GRÄFENDORF","GRÄFENDORF",677133,514,""]
[null,"GRÄFENDORF","MICHELAU A.D.SAALE",677133,515,""]
[null,"GRÄFENDORF","WEICKERSGRÜBEN",677133,516,""]
[null,"GRAFENGEHAIG","GRAFENGEHAIG",477117,1718,""]
[null,"GRAFENGEHAIG","EPPENREUTH",477117,1719,""]
[null,"GRAFENGEHAIG","SCHLOCKENAU",477117,1720,""]
[null,"GRAFENGEHAIG","WALBERNGRÜN",477117,1721,""]
[null,"GRAFENGEHAIG","HORBACH",477117,1722,""]
[null,"GRAFENGEHAIG","RAPPETENREUTH",477117,1723,""]
[null,"GRAFENGEHAIG","GRÜNLAS",477117,1724,""]
[null,"GRAFENGEHAIG","WEIDMES",477117,1725,""]
[null,"GRAFENRHEINFELD","GRAFENRHEINFELD",678136,933,""]
[null,"GRAFENWIESEN","RIMBACH",372130,5106,""]
[null,"GRAFENWIESEN","VOGGENDORF",372130,5107,""]
[null,"GRAFENWIESEN","GRAFENWIESEN",372130,5108,""]
[null,"GRAFENWÖHR","THOMASREUTH",374124,4262,""]
[null,"GRAFENWÖHR","GRAFENWÖHR",374124,4271,""]
[null,"GRAFENWÖHR","GMÜND",374124,4272,""]
[null,"GRAFENWÖHR","HÜTTEN",374124,4273,""]
[null,"GRAFING B.MÜNCHEN","ELKOFEN",175122,8757,""]
[null,"GRAFING B.MÜNCHEN","GRAFING B.MÜNCHEN",175122,8762,""]
[null,"GRAFING B.MÜNCHEN","NETTELKOFEN",175122,8768,""]
[null,"GRAFING B.MÜNCHEN","OEXING",175122,8771,""]
[null,"GRAFING B.MÜNCHEN","STRAUßDORF",175122,8779,""]
[null,"GRAFLING","BERGERN",271122,5904,""]
[null,"GRAFLING","HIRSCHBERG",271122,5905,""]
[null,"GRAFLING","GRAFLING",271122,5906,""]
[null,"GRAFLING","ALBERTING",271122,5907,""]
[null,"GRAFRATH","UNTERALTING",179125,8493,""]
[null,"GRAFRATH","WILDENROTH",179125,8494,""]
[null,"GRAINAU","GRAINAU",180118,9262,""]
[null,"GRAINET","REHBERG",272121,5850,""]
[null,"GRAINET","GRAINET",272121,5851,""]
[null,"GRAINET","BÖHMZWIESEL",272121,5864,""]
[null,"GRAINET","FÜRHOLZ",272121,5865,""]
[null,"GRAINET","VORDERFREUNDORF",272121,5866,""]
[null,"GRAINETER WALD","GRAINET",272453,5851,""]
[null,"GRAMSCHATZER WALD","GRAMSCHATZER WALD",679451,657,""]
[null,"GRASBRUNN","GRASBRUNN",184121,8674,""]
[null,"GRASSAU","ROTTAU",189120,9856,""]
[null,"GRASSAU","GRASSAU",189120,9857,""]
[null,"GRATTERSDORF","NABIN",271123,5924,""]
[null,"GRATTERSDORF","OBERAIGN",271123,5925,""]
[null,"GRATTERSDORF","GRATTERSDORF",271123,5926,""]
[null,"GRATTERSDORF","WINSING",271123,5927,""]
[null,"GREDING","ESSELBERG",576122,3822,""]
[null,"GREDING","EUERWANG",576122,3823,""]
[null,"GREDING","GRAFENBERG",576122,3829,""]
[null,"GREDING","GREDING",576122,3830,""]
[null,"GREDING","GROßHÖBING",576122,3831,""]
[null,"GREDING","HAUSEN",576122,3839,""]
[null,"GREDING","HEIMBACH",576122,3841,""]
[null,"GREDING","HERRNSBERG",576122,3842,{"$f":"+IF(A2690<>\"\",1,\"\")","v":""}]
[null,"GREDING","KAISING",576122,3847,""]
[null,"GREDING","KLEINNOTTERSDORF",576122,3851,""]
[null,"GREDING","KRAFTSBUCH",576122,3853,""]
[null,"GREDING","LANDERZHOFEN",576122,3858,""]
[null,"GREDING","METTENDORF",576122,3865,""]
[null,"GREDING","OBERMÄSSING",576122,3870,""]
[null,"GREDING","ÖSTERBERG",576122,3872,""]
[null,"GREDING","RÖCKENHOFEN",576122,3888,""]
[null,"GREDING","SCHUTZENDORF",576122,3897,""]
[null,"GREDING","UNTERMÄSSING",576122,3907,""]
[null,"GREIFENBERG","BEUERN",181123,9004,""]
[null,"GREIFENBERG","GREIFENBERG",181123,9021,""]
[null,"GREILING","GREILING",173127,9410,""]
[null,"GREMSDORF","BUCH",572126,2762,""]
[null,"GREMSDORF","GREMSDORF",572126,2784,""]
[null,"GRETTSTADT","UNTEREUERHEIM",678138,935,""]
[null,"GRETTSTADT","OBEREUERHEIM",678138,936,""]
[null,"GRETTSTADT","GRETTSTADT",678138,956,""]
[null,"GRETTSTADT","DÜRRFELD",678138,957,""]
[null,"GREUßENHEIM","GREUßENHEIM",679141,683,""]
[null,"GRIESSTÄTT","GRIESSTÄTT",187134,9776,""]
[null,"GRIESSTÄTT","KOLBING",187134,9777,""]
[null,"GRIESSTÄTT","HOLZHAUSEN",187134,9778,""]
[null,"GRÖBENZELL","GRÖBENZELL",179126,8464,""]
[null,"GROßAITINGEN","GROßAITINGEN",772151,7320,""]
[null,"GROßAITINGEN","REINHARTSHOFEN",772151,7321,""]
[null,"GROßBARDORF","GROßBARDORF",673126,112,""]
[null,"GROßEIBSTADT","GROßEIBSTADT",673127,96,""]
[null,"GROßEIBSTADT","KLEINEIBSTADT",673127,105,""]
[null,"GROßENSEEBACH","GROßENSEEBACH",572127,2787,""]
[null,"GROßER AUERSBERG","GROßER AUERSBERG",672457,162,""]
[null,"GROßHABERSDORF","DEBERNDORF",573115,3347,""]
[null,"GROßHABERSDORF","GROßHABERSDORF",573115,3354,""]
[null,"GROßHABERSDORF","UNTERSCHLAUERSBACH",573115,3355,""]
[null,"GROßHABERSDORF","FERNABRÜNST",573115,3356,""]
[null,"GROßHEIRATH","BUCHENROD",473132,1323,""]
[null,"GROßHEIRATH","GOSSENBERG",473132,1360,""]
[null,"GROßHEIRATH","GROßHEIRATH",473132,1363,""]
[null,"GROßHEIRATH","NEUSES A.D.EICHEN",473132,1431,""]
[null,"GROßHEIRATH","ROSSACH",473132,1458,""]
[null,"GROßHEIRATH","WATZENDORF",473132,1513,""]
[null,"GROßHEUBACH","GROßHEUBACH",676125,450,""]
[null,"GROßKAROLINENFELD","GROßKAROLINENFELD",187137,9625,""]
[null,"GROßKAROLINENFELD","TATTENHAUSEN",187137,9675,""]
[null,"GROßKAROLINENFELD","WESTERNDORF ST.PETER",187137,9681,""]
[null,"GROßLANGHEIM","GROßLANGHEIM",675131,1169,""]
[null,"GROßMEHRING","THEIßING",176129,8046,""]
[null,"GROßMEHRING","DEMLING",176129,8047,""]
[null,"GROßMEHRING","GROßMEHRING",176129,8048,""]
[null,"GROßOSTHEIM","GROßOSTHEIM",671122,382,""]
[null,"GROßOSTHEIM","PFLAUMHEIM",671122,386,""]
[null,"GROßOSTHEIM","WENIGUMSTADT",671122,389,""]
[null,"GROßWALLSTADT","GROßWALLSTADT",676126,409,""]
[null,"GROßWEIL","KLEINWEIL",180119,9245,""]
[null,"GROßWEIL","GROßWEIL",180119,9246,""]
[null,"GRUB A.FORST","GRUB A.FORST",473134,1365,""]
[null,"GRUB A.FORST","ROHRBACH",473134,1457,""]
[null,"GRUB A.FORST","ROTH A.FORST",473134,1461,""]
[null,"GRUB A.FORST","ZEICKHORN",473134,1535,""]
[null,"GRÜNENBACH","GRÜNENBACH",776113,7956,""]
[null,"GRÜNENBACH","EBRATSHOFEN",776113,7957,""]
[null,"GRÜNWALD","GRÜNWALD",184122,8676,""]
[null,"GRÜNWALD","GRÜNWALDER FORST",184122,8715,""]
[null,"GRÜNWALDER FORST","GRÜNWALDER FORST",184454,8715,{"$f":"+IF(A2754<>\"\",1,\"\")","v":""}]
[null,"GSTADT A.CHIEMSEE","GSTADT A.CHIEMSEE",187138,9626,""]
[null,"GUNDELFINGEN A.D.DON","GUNDELFINGEN A.D.DONAU",773136,6853,""]
[null,"GUNDELFINGEN A.D.DON","PETERSWÖRTH",773136,6854,""]
[null,"GUNDELFINGEN A.D.DON","ECHENBRUNN",773136,6855,""]
[null,"GUNDELSHEIM","GUNDELSHEIM",471137,2175,""]
[null,"GUNDREMMINGEN","GUNDREMMINGEN",774136,7116,""]
[null,"GÜNTERSLEBEN","GÜNTERSLEBEN",679142,667,""]
[null,"GÜNTHERSBÜHLER FORST","GÜNTHERSBÜHLER FORST",574457,3526,""]
[null,"GÜNZACH","GÜNZACH",777138,7697,""]
[null,"GÜNZBURG","RIEDHAUSEN B.GÜNZBURG",774135,7106,""]
[null,"GÜNZBURG","GÜNZBURG",774135,7107,""]
[null,"GÜNZBURG","REISENSBURG",774135,7108,""]
[null,"GÜNZBURG","DENZINGEN",774135,7109,""]
[null,"GÜNZBURG","NORNHEIM",774135,7110,""]
[null,"GÜNZBURG","WASSERBURG",774135,7111,""]
[null,"GÜNZBURG","DEFFINGEN",774135,7112,""]
[null,"GÜNZBURG","LEINHEIM",774135,7113,""]
[null,"GUNZENHAUSEN","STREUDORF",577136,3601,""]
[null,"GUNZENHAUSEN","WALD",577136,3602,""]
[null,"GUNZENHAUSEN","BÜCHELBERG",577136,3603,""]
[null,"GUNZENHAUSEN","LAUBENZEDEL",577136,3604,""]
[null,"GUNZENHAUSEN","SCHLUNGENHOF",577136,3605,""]
[null,"GUNZENHAUSEN","GUNZENHAUSEN",577136,3606,""]
[null,"GUNZENHAUSEN","FRICKENFELDEN",577136,3607,""]
[null,"GUNZENHAUSEN","CRONHEIM",577136,3608,""]
[null,"GUNZENHAUSEN","UNTERWURMBACH",577136,3609,""]
[null,"GUNZENHAUSEN","AHA",577136,3610,""]
[null,"GUNZENHAUSEN","OBERASBACH",577136,3611,""]
[null,"GUNZENHAUSEN","STETTEN",577136,3612,""]
[null,"GUNZENHAUSEN","NORDSTETTEN",577136,3613,""]
[null,"GUNZENHAUSEN","PFLAUMFELD",577136,3614,""]
[null,"GUNZENHAUSEN","UNTERASBACH",577136,3615,""]
[null,"GUTENECK","PAMSENDORF",376133,4817,""]
[null,"GUTENECK","UNTERAICH",376133,4865,""]
[null,"GUTENECK","GUTENECK",376133,4866,""]
[null,"GUTENECK","PISCHDORF",376133,4867,""]
[null,"GUTENSTETTEN","GUTENSTETTEN",575128,3260,""]
[null,"GUTENSTETTEN","ROCKENBACH",575128,3261,""]
[null,"GUTENSTETTEN","BERGTHEIM",575128,3262,""]
[null,"GUTENSTETTEN","REINHARDSHOFEN",575128,3263,""]
[null,"GUTENSTETTEN","PAHRES",575128,3264,""]
[null,"GUTTENBERG","GUTTENBERG",477118,1761,""]
[null,"GUTTENBERGER WALD","GUTTENBERGER WALD",679452,706,""]
[null,"HAAG","FORST THIERGARTEN",472146,2469,""]
[null,"HAAG","OBERNSCHREEZ",472146,2485,""]
[null,"HAAG","UNTERNSCHREEZ",472146,2486,""]
[null,"HAAG","HAAG",472146,2487,""]
[null,"HAAG A.D.AMPER","PLÖRNBACH",178129,8291,""]
[null,"HAAG A.D.AMPER","HAAG A.D.AMPER",178129,8292,""]
[null,"HAAG A.D.AMPER","INKOFEN",178129,8293,""]
[null,"HAAG I.OB","HAAG I.OB",183119,9706,""]
[null,"HAAG I.OB","WINDEN",183119,9707,""]
[null,"HAAG I.OB","ROSENBERG",183119,9708,""]
[null,"HAAG I.OB","ALLMANNSAU",183119,9709,""]
[null,"HAAR","HAAR",184123,8677,""]
[null,"HAARBACH","HAARBACH",275125,6365,""]
[null,"HAARBACH","SACHSENHAM",275125,6366,""]
[null,"HAARBACH","UTTLAU",275125,6367,""]
[null,"HABACH","HABACH",190126,9230,""]
[null,"HACKLBERG","NEUESSING",273453,6061,""]
[null,"HAFENLOHR","FÜRSTL.LÖWENSTEIN'SCHER PARK",677135,574,""]
[null,"HAFENLOHR","WINDHEIM",677135,582,""]
[null,"HAFENLOHR","HAFENLOHR",677135,593,""]
[null,"HAGELSTADT","GAILSBACH",375143,5236,{"$f":"+IF(A2818<>\"\",1,\"\")","v":""}]
[null,"HAGELSTADT","HAGELSTADT",375143,5251,""]
[null,"HAGELSTADT","LANGENERLING",375143,5278,""]
[null,"HAGENBÜCHACH","HAGENBÜCHACH",575129,3303,""]
[null,"HAGENBÜCHACH","BRÄUERSDORF",575129,3304,""]
[null,"HAHNBACH","IRLBACH",371126,4473,""]
[null,"HAHNBACH","ADLHOLZ",371126,4474,""]
[null,"HAHNBACH","GROßSCHÖNBRUNN",371126,4475,""]
[null,"HAHNBACH","IBER",371126,4484,""]
[null,"HAHNBACH","SÜß",371126,4485,""]
[null,"HAHNBACH","HAHNBACH",371126,4486,""]
[null,"HAHNBACH","SCHALKENTHAN",371126,4487,""]
[null,"HAHNBACH","MIMBACH",371126,4489,""]
[null,"HAHNBACH","KÖTZERSRICHT",371126,4500,""]
[null,"HAHNBACH","URSULAPOPPENRICHT",371126,4501,""]
[null,"HAIBACH (LKR. AB)","HAIBACH",671124,369,""]
[null,"HAIBACH (LKR. AB)","GRÜNMORSBACH",671124,377,""]
[null,"HAIBACH (LKR. AB)","DÖRRMORSBACH",671124,378,""]
[null,"HAIBACH (LKR. SR)","IRSCHENBACH",278129,5567,""]
[null,"HAIBACH (LKR. SR)","PRÜNSTFEHLBURG",278129,5568,""]
[null,"HAIBACH (LKR. SR)","ELISABETHSZELL",278129,5569,""]
[null,"HAIBACH (LKR. SR)","HAIBACH",278129,5574,""]
[null,"HAIBACH (LKR. SR)","LANDASBERG",278129,5581,""]
[null,"HAIDMÜHLE","PHILIPPSREUT",272122,5821,""]
[null,"HAIDMÜHLE","BISCHOFSREUT",272122,5822,""]
[null,"HAIDMÜHLE","FRAUENBERG",272122,5852,""]
[null,"HAIMENDORFER FORST","HAIMENDORFER FORST",574458,3484,""]
[null,"HAIMHAUSEN","AMPERPETTENBACH",174121,8603,""]
[null,"HAIMHAUSEN","HAIMHAUSEN",174121,8621,""]
[null,"HAIMING","HAIMING",171118,8915,""]
[null,"HAIMING","PIESING",171118,8930,""]
[null,"HAIMING","DAXENTHALER FORST",171118,8948,""]
[null,"HAIMING","HOLZFELDER FORST",171118,8949,""]
[null,"HAINSFARTH","HAINSFARTH",779154,6719,""]
[null,"HAINSFARTH","STEINHART",779154,6720,""]
[null,"HAINSTETTER WALD","FREUDENBERG",371454,4522,""]
[null,"HALBLECH","TRAUCHGAU",777173,7917,""]
[null,"HALBLECH","BUCHING",777173,7918,""]
[null,"HALBLECH","FRONREITENER FORST",777173,9104,""]
[null,"HALDENWANG (LKR. GZ)","KONZENBERG",774140,7126,""]
[null,"HALDENWANG (LKR. GZ)","HAFENHOFEN",774140,7127,""]
[null,"HALDENWANG (LKR. GZ)","EICHENHOFEN",774140,7128,""]
[null,"HALDENWANG (LKR. GZ)","HALDENWANG",774140,7129,""]
[null,"HALDENWANG (LKR. OA)","HALDENWANG",780122,7663,""]
[null,"HALFING","HALFING",187139,9627,""]
[null,"HALLBERGMOOS","HALLBERGMOOS",178130,8335,""]
[null,"HALLBERGMOOS","GOLDACH",178130,8336,""]
[null,"HALLERNDORF","SCHNAID",474133,2646,""]
[null,"HALLERNDORF","HALLERNDORF",474133,2647,""]
[null,"HALLERNDORF","TRAILSDORF",474133,2648,""]
[null,"HALLERNDORF","SCHLAMMERSDORF",474133,2649,""]
[null,"HALLERNDORF","PAUTZFELD",474133,2650,""]
[null,"HALLERNDORF","WILLERSDORF",474133,2651,""]
[null,"HALLERNDORF","UNTERE MARK",474133,2652,""]
[null,"HALLSTADT","DÖRFLEINS",471140,2139,""]
[null,"HALLSTADT","HALLSTADT",471140,2179,""]
[null,"HALSBACH","HALSBACH",171119,8916,""]
[null,"HALSBACH","OBERZEITLARN",171119,8928,""]
[null,"HAMMELBURG","UNTERERTHAL",672127,262,""]
[null,"HAMMELBURG","OBERERTHAL",672127,263,""]
[null,"HAMMELBURG","FEUERTHAL",672127,264,""]
[null,"HAMMELBURG","DIEBACH",672127,278,""]
[null,"HAMMELBURG","HAMMELBURG",672127,279,""]
[null,"HAMMELBURG","WESTHEIM",672127,280,""]
[null,"HAMMELBURG","MORLESAU",672127,284,{"$f":"+IF(A2882<>\"\",1,\"\")","v":""}]
[null,"HAMMELBURG","UNTERESCHENBACH",672127,285,""]
[null,"HAMMELBURG","OBERESCHENBACH",672127,291,""]
[null,"HAMMELBURG","PFAFFENHAUSEN",672127,292,""]
[null,"HAMMELBURG","HUNDSFELD",672127,294,""]
[null,"HAMMELBURG","BONNLAND",672127,295,""]
[null,"HAMMELBURG","GAUASCHACH",672127,296,""]
[null,"HAPPURG","BREITENBRUNN",574128,3511,""]
[null,"HAPPURG","FÖRRENBACH",574128,3519,""]
[null,"HAPPURG","HAPPURG",574128,3529,""]
[null,"HAPPURG","KAINSBACH",574128,3542,""]
[null,"HAPPURG","POLLANDEN",574128,3560,""]
[null,"HAPPURG","THALHEIM",574128,3576,""]
[null,"HARBURG I.SCHWABEN","SCHRATTENHOFEN",779155,6924,""]
[null,"HARBURG I.SCHWABEN","HEROLDINGEN",779155,6925,""]
[null,"HARBURG I.SCHWABEN","HOPPINGEN",779155,6926,""]
[null,"HARBURG I.SCHWABEN","RONHEIM",779155,6927,""]
[null,"HARBURG I.SCHWABEN","MÜNDLING",779155,6928,""]
[null,"HARBURG I.SCHWABEN","GROßSORHEIM",779155,6929,""]
[null,"HARBURG I.SCHWABEN","HARBURG (SCHWABEN)",779155,6930,""]
[null,"HARBURG I.SCHWABEN","BRÜNSEE",779155,6931,""]
[null,"HARBURG I.SCHWABEN","MAUREN",779155,6932,""]
[null,"HARBURG I.SCHWABEN","EBERMERGEN",779155,6933,""]
[null,"HARSDORF","TREBGASTER FORST",477119,1766,""]
[null,"HARSDORF","HARSDORF",477119,1769,""]
[null,"HART","KIRCHDORF A.INN",277451,6520,""]
[null,"HARTENSTEIN","HARTENSTEIN",574459,3530,""]
[null,"HARTENSTEIN (LKR. RH)","ENZENDORF",574129,3517,""]
[null,"HARTENSTEIN (LKR. RH)","GRÜNREUTH",574129,3524,""]
[null,"HARTENSTEIN (LKR. RH)","HARTENSTEIN",574129,3530,""]
[null,"HASELBACH","HASELBACH",278134,5573,""]
[null,"HASELBACH","DACHSBERG",278134,5582,""]
[null,"HASLOCH","HASSELBERG",677137,602,""]
[null,"HASLOCH","HASLOCH",677137,603,""]
[null,"HAßFURT","UCHENHOFEN",674147,879,""]
[null,"HAßFURT","SAILERSHAUSEN",674147,897,""]
[null,"HAßFURT","OBERHOHENRIED",674147,898,""]
[null,"HAßFURT","UNTERHOHENRIED",674147,899,""]
[null,"HAßFURT","SYLBACH",674147,900,""]
[null,"HAßFURT","PRAPPACH",674147,901,""]
[null,"HAßFURT","WÜLFLINGEN",674147,917,""]
[null,"HAßFURT","HAßFURT",674147,918,""]
[null,"HAßFURT","AUGSFELD",674147,942,""]
[null,"HATTENHOFEN","HATTENHOFEN",179128,8472,""]
[null,"HAUNDORF","HAUNDORF",577138,3618,""]
[null,"HAUNDORF","OBERERLBACH",577138,3619,""]
[null,"HAUNDORF","GRÄFENSTEINBERG",577138,3620,""]
[null,"HAUNSHEIM","UNTERBECHINGEN",773137,6848,""]
[null,"HAUNSHEIM","HAUNSHEIM",773137,6849,""]
[null,"HAUNSTETTER FORST","HAUNSTETTEN",176451,3978,""]
[null,"HAUPTSMOOR","HAUPTSMOOR",471455,2184,""]
[null,"HAURAIN","HAURAIN",677457,524,""]
[null,"HAUSEN (LKR. FO)","UNTERE MARK",474134,2652,""]
[null,"HAUSEN (LKR. FO)","WIMMELBACH",474134,2676,""]
[null,"HAUSEN (LKR. FO)","HAUSEN",474134,2677,""]
[null,"HAUSEN (LKR. KEH)","GROßMUß",273125,6027,""]
[null,"HAUSEN (LKR. KEH)","HAUSEN",273125,6029,""]
[null,"HAUSEN (LKR. KEH)","HERRNWAHLTHANN",273125,6033,""]
[null,"HAUSEN (LKR. MIL)","HAUSEN",676128,411,""]
[null,"HAUSEN (LKR. NES)","HAUSEN",673129,11,""]
[null,"HAUSEN (LKR. NES)","ROTH",673129,15,""]
[null,"HAUSEN B.WÜRZBURG","ERBSHAUSEN",679143,659,""]
[null,"HAUSEN B.WÜRZBURG","HAUSEN",679143,660,""]
[null,"HAUSEN B.WÜRZBURG","RIEDEN",679143,661,""]
[null,"HAUSHAM","HAUSHAM",182119,9517,{"$f":"+IF(A2946<>\"\",1,\"\")","v":""}]
[null,"HAUSHAM","WÖRNSMÜHL",182119,9518,""]
[null,"HAUZENBERG","RAßBERG",275126,6310,""]
[null,"HAUZENBERG","WOTZDORF",275126,6311,""]
[null,"HAUZENBERG","HAUZENBERG",275126,6312,""]
[null,"HAUZENBERG","RAßREUTH",275126,6313,""]
[null,"HAUZENBERG","OBERDIENDORF",275126,6314,""]
[null,"HAUZENBERG","JAHRDORF",275126,6315,""]
[null,"HAUZENBERG","GERMANNSDORF",275126,6316,""]
[null,"HAUZENBERG","WINDPASSING",275126,6317,""]
[null,"HAUZENBERG","OBERNEUREUTH",275126,6318,""]
[null,"HAWANGEN","HAWANGEN",778149,7582,""]
[null,"HEBERTSFELDEN","GERN",277124,6417,""]
[null,"HEBERTSFELDEN","HEBERTSFELDEN",277124,6420,""]
[null,"HEBERTSFELDEN","LANGENECK",277124,6430,""]
[null,"HEBERTSFELDEN","LINDEN",277124,6433,""]
[null,"HEBERTSFELDEN","LOHBRUCK",277124,6435,""]
[null,"HEBERTSFELDEN","PETERSKIRCHEN",277124,6449,""]
[null,"HEBERTSFELDEN","UNTERHAUSBACH",277124,6474,""]
[null,"HEBERTSHAUSEN","AMPERMOCHING",174122,8602,""]
[null,"HEBERTSHAUSEN","AMPERPETTENBACH",174122,8603,""]
[null,"HEBERTSHAUSEN","HEBERTSHAUSEN",174122,8622,""]
[null,"HEBERTSHAUSEN","PRITTLBACH",174122,8639,""]
[null,"HEBERTSHAUSEN","UNTERWEILBACH",174122,8650,""]
[null,"HEIDECK","ABERZHAUSEN",576126,3803,""]
[null,"HEIDECK","HEIDECK",576126,3840,""]
[null,"HEIDECK","LAFFENAU",576126,3854,""]
[null,"HEIDECK","LAIBSTADT",576126,3855,""]
[null,"HEIDECK","LIEBENSTADT",576126,3861,""]
[null,"HEIDECK","RUDLETZHOLZ",576126,3894,""]
[null,"HEIDECK","SCHLOßBERG",576126,3896,""]
[null,"HEIDECK","SELINGSTADT",576126,3901,""]
[null,"HEIDENBERG","OTTERSDORF",576454,3875,""]
[null,"HEIDENHEIM","HEIDENHEIM",577140,3643,""]
[null,"HEIDENHEIM","HOHENTRÜDINGEN",577140,3644,""]
[null,"HEIDENHEIM","HECHLINGEN A.SEE",577140,3645,""]
[null,"HEIDENHEIM","DEGERSHEIM",577140,3646,""]
[null,"HEIGENBRÜCKEN","JAKOBSTHAL",671126,340,""]
[null,"HEIGENBRÜCKEN","HEIGENBRÜCKEN",671126,359,""]
[null,"HEILIGENSTADT I.OFR.","BRUNN",471142,2122,""]
[null,"HEILIGENSTADT I.OFR.","BURGGRUB",471142,2127,""]
[null,"HEILIGENSTADT I.OFR.","GEISBERGER FORST",471142,2163,""]
[null,"HEILIGENSTADT I.OFR.","HEILIGENSTADT I.OFR.",471142,2185,""]
[null,"HEILIGENSTADT I.OFR.","HERZOGENREUTH",471142,2187,""]
[null,"HEILIGENSTADT I.OFR.","HOHENPÖLZ",471142,2195,""]
[null,"HEILIGENSTADT I.OFR.","KALTENEGGOLSFELD",471142,2199,""]
[null,"HEILIGENSTADT I.OFR.","LINDACH",471142,2213,""]
[null,"HEILIGENSTADT I.OFR.","NEUDORF",471142,2238,""]
[null,"HEILIGENSTADT I.OFR.","OBERLEINLEITER",471142,2244,""]
[null,"HEILIGENSTADT I.OFR.","OBERNGRUB",471142,2247,""]
[null,"HEILIGENSTADT I.OFR.","SIEGRITZ",471142,2288,""]
[null,"HEILIGENSTADT I.OFR.","STÜCHT",471142,2301,""]
[null,"HEILIGENSTADT I.OFR.","TEUCHATZ",471142,2302,""]
[null,"HEILIGENSTADT I.OFR.","TIEFENPÖLZ",471142,2306,""]
[null,"HEILIGENSTADT I.OFR.","TRAINDORF",471142,2308,""]
[null,"HEILIGENSTADT I.OFR.","ZOGGENDORF",471142,2348,""]
[null,"HEILSBRONN","BETZENDORF",571165,3113,""]
[null,"HEILSBRONN","BONNHOF",571165,3117,""]
[null,"HEILSBRONN","BÜRGLEIN",571165,3124,""]
[null,"HEILSBRONN","HEILSBRONN",571165,3154,""]
[null,"HEILSBRONN","HÖFSTETTEN",571165,3163,""]
[null,"HEILSBRONN","KETTELDORF",571165,3171,""]
[null,"HEILSBRONN","MÜNCHERLBACH",571165,3191,""]
[null,"HEILSBRONN","SEITENDORF",571165,3218,""]
[null,"HEILSBRONN","WEIßENBRONN",571165,3238,{"$f":"+IF(A3010<>\"\",1,\"\")","v":""}]
[null,"HEILSBRONN","WEITERNDORF",571165,3239,""]
[null,"HEIMBUCHENTHAL","HEIMBUCHENTHAL",671127,390,""]
[null,"HEIMBUCHENTHAL","KRAUSENBACHER FORST",671127,393,""]
[null,"HEIMENKIRCH","HEIMENKIRCH",776114,7949,""]
[null,"HEIMERTINGEN","HEIMERTINGEN",778150,7553,""]
[null,"HEINERSREUTH","ALTENPLOS",472150,2425,""]
[null,"HEINERSREUTH","UNTERWAIZ",472150,2426,""]
[null,"HEINERSREUTH","COTTENBACH",472150,2427,""]
[null,"HEINERSREUTH","HEINERSREUTH",472150,2428,""]
[null,"HEINERSREUTHER FORST (LKR. BT)","HEINERSREUTHER FORST",472458,2424,""]
[null,"HEINERSREUTHER FORST (LKR. NEW)","HEINERSREUTH",374451,4241,""]
[null,"HEINRICHSTHAL","HEINRICHSTHAL",671128,331,""]
[null,"HEINRICHSTHALER FORST","HEINRICHSTHALER FORST",671453,341,""]
[null,"HELDENSTEIN","WEIDENBACH",183120,8837,""]
[null,"HELDENSTEIN","LAUTERBACH",183120,8838,""]
[null,"HELDENSTEIN","HELDENSTEIN",183120,8839,""]
[null,"HELMBRECHTS","AHORNBERG",475136,1898,""]
[null,"HELMBRECHTS","HELMBRECHTS",475136,1899,""]
[null,"HELMBRECHTS","KLEINSCHWARZENBACH",475136,1900,""]
[null,"HELMBRECHTS","BAIERGRÜN",475136,1901,""]
[null,"HELMBRECHTS","ENCHENREUTH",475136,1902,""]
[null,"HELMBRECHTS","GÖSMES",475136,1903,""]
[null,"HELMBRECHTS","OBERWEIßENBACH",475136,1904,""]
[null,"HELMBRECHTS","WÜSTENSELBITZ",475136,1905,""]
[null,"HELMSTADT","HOLZKIRCHHAUSEN",679144,700,""]
[null,"HELMSTADT","HELMSTADT",679144,701,""]
[null,"HEMAU","MAUSHEIM",375148,5452,""]
[null,"HEMAU","BERLETZHOF",375148,5477,""]
[null,"HEMAU","PELLNDORF",375148,5478,""]
[null,"HEMAU","NEUKIRCHEN",375148,5479,""]
[null,"HEMAU","THONLOHE",375148,5480,""]
[null,"HEMAU","LANGENKREITH",375148,5481,""]
[null,"HEMAU","HEMAU",375148,5482,""]
[null,"HEMAU","KOLLERSRIED",375148,5483,""]
[null,"HEMAU","LAUFENTHAL",375148,5484,""]
[null,"HEMAU","HAAG",375148,5485,""]
[null,"HEMAU","AICHKIRCHEN",375148,5486,""]
[null,"HEMAU","KLINGEN",375148,5487,""]
[null,"HEMAU","HOHENSCHAMBACH",375148,5488,""]
[null,"HEMHOFEN","HEMHOFEN",572130,2792,""]
[null,"HEMHOFEN","ZECKERN",572130,2850,""]
[null,"HEMMERSHEIM","GÜLCHSHEIM",575130,2960,""]
[null,"HEMMERSHEIM","HEMMERSHEIM",575130,2970,""]
[null,"HEMMERSHEIM","LIPPRICHHAUSEN",575130,2991,""]
[null,"HEMMERSHEIM","PFAHLENHEIM",575130,3020,""]
[null,"HENDUNGEN","HENDUNGEN",673130,55,""]
[null,"HENDUNGEN","RAPPERSHAUSEN",673130,56,""]
[null,"HENFENFELD","HENFENFELD",574131,3534,""]
[null,"HENGERSBERG","SEEBACH",271125,5919,""]
[null,"HENGERSBERG","ALTENUFER",271125,5941,""]
[null,"HENGERSBERG","HENGERSBERG",271125,5942,""]
[null,"HENGERSBERG","SCHWARZACH",271125,5943,""]
[null,"HENGERSBERG","WALTERSDORF",271125,5946,""]
[null,"HENGERSBERG","SCHWANENKIRCHEN",271125,5947,""]
[null,"HEPBERG","HEPBERG",176131,8025,""]
[null,"HERBSTADT","BREITENSEE",673131,72,""]
[null,"HERBSTADT","OTTELMANNSHAUSEN",673131,85,""]
[null,"HERBSTADT","HERBSTADT",673131,86,""]
[null,"HERETSRIED","HERETSRIED",772156,7222,""]
[null,"HERETSRIED","LAUTERBRUNN",772156,7223,""]
[null,"HERGATZ","WOHMBRECHTS",776131,7947,""]
[null,"HERGATZ","MARIA-THANN",776131,7948,""]
[null,"HERGENSWEILER","HERGENSWEILER",776115,7945,""]
[null,"HEROLDSBACH","UNTERE MARK",474135,2652,{"$f":"+IF(A3074<>\"\",1,\"\")","v":""}]
[null,"HEROLDSBACH","OESDORF",474135,2673,""]
[null,"HEROLDSBACH","HEROLDSBACH",474135,2674,""]
[null,"HEROLDSBACH","THURN",474135,2675,""]
[null,"HEROLDSBERG","ERLENSTEGENER FORST",572131,2773,""]
[null,"HEROLDSBERG","GESCHAIDT",572131,2783,""]
[null,"HEROLDSBERG","GROßGESCHAIDT",572131,2788,""]
[null,"HEROLDSBERG","HEROLDSBERG",572131,2794,""]
[null,"HEROLDSBERG","KLEINGESCHAIDT",572131,2805,""]
[null,"HERRIEDEN","ELBERSROTH",571166,3132,""]
[null,"HERRIEDEN","HERRIEDEN",571166,3159,""]
[null,"HERRIEDEN","HEUBERG",571166,3161,""]
[null,"HERRIEDEN","HOHENBERG",571166,3164,""]
[null,"HERRIEDEN","LAMMELBACH",571166,3176,""]
[null,"HERRIEDEN","NEUNSTETTEN",571166,3195,""]
[null,"HERRIEDEN","OBERSCHÖNBRONN",571166,3202,""]
[null,"HERRIEDEN","RAUENZELL",571166,3209,""]
[null,"HERRIEDEN","STADEL",571166,3223,""]
[null,"HERRNGIERSDORF","HERRNGIERSDORF",273127,6031,""]
[null,"HERRNGIERSDORF","LANGQUAID",273127,6047,""]
[null,"HERRNWALD","HERRNWALD",677458,509,""]
[null,"HERRSCHING A.AMMERSE","BREITBRUNN A.AMMERSEE",188124,9168,""]
[null,"HERRSCHING A.AMMERSE","HERRSCHING A.AMMERSEE",188124,9176,""]
[null,"HERRSCHING A.AMMERSE","WIDDERSBERG",188124,9177,""]
[null,"HERSBRUCK","ALTENSITTENBACH",574132,3504,""]
[null,"HERSBRUCK","ELLENBACH",574132,3515,""]
[null,"HERSBRUCK","HERSBRUCK",574132,3535,""]
[null,"HERSBRUCK","HERSBRUCK, BERGWERKE",574132,3590,""]
[null,"HERSBRUCK","HERSBRUCK, FISCHEREIRECHTE",574132,3591,""]
[null,"HERZOGENAURACH","BURGSTALL",572132,2767,""]
[null,"HERZOGENAURACH","HAMMERBACH",572132,2789,""]
[null,"HERZOGENAURACH","HAUNDORF",572132,2791,""]
[null,"HERZOGENAURACH","HERZOGENAURACH",572132,2796,""]
[null,"HERZOGENAURACH","NIEDERNDORF",572132,2823,""]
[null,"HERZOGENAURACH","ZWEIFELSHEIM",572132,2852,""]
[null,"HEßDORF","HANNBERG",572133,2790,""]
[null,"HEßDORF","HEßDORF",572133,2797,""]
[null,"HEßDORF","HESSELBERG",572133,2798,""]
[null,"HEßDORF","KÄFERHÖLZLEIN U.EICHELBERG",572133,2801,""]
[null,"HESSENREUTHER FORST","GUTTENBERG",377454,4235,""]
[null,"HETTENSHAUSEN","HETTENSHAUSEN",186126,8234,""]
[null,"HETTENSHAUSEN","ENTRISCHENBRUNN",186126,8235,""]
[null,"HETTSTADT","HETTSTADT",679146,694,""]
[null,"HETZLES","HETZLES",474137,2704,""]
[null,"HEUSTREU","HEUSTREU",673133,64,""]
[null,"HIENHEIMER FORST","HIENHEIMER FORST",273454,6035,""]
[null,"HILGERTSHAUSEN-TANDE","HILGERTSHAUSEN",174147,8557,""]
[null,"HILGERTSHAUSEN-TANDE","OBERDORF",174147,8561,""]
[null,"HILGERTSHAUSEN-TANDE","RANDELSRIED",174147,8563,""]
[null,"HILGERTSHAUSEN-TANDE","TANDERN",174147,8565,""]
[null,"HILPOLTSTEIN","HAGENBUCH",576127,3836,""]
[null,"HILPOLTSTEIN","HEUBERG",576127,3843,""]
[null,"HILPOLTSTEIN","HILPOLTSTEIN",576127,3844,""]
[null,"HILPOLTSTEIN","HOFSTETTEN",576127,3845,""]
[null,"HILPOLTSTEIN","JAHRSDORF",576127,3846,""]
[null,"HILPOLTSTEIN","KARM",576127,3849,""]
[null,"HILPOLTSTEIN","LAMPERSDORF",576127,3856,""]
[null,"HILPOLTSTEIN","LAY",576127,3859,""]
[null,"HILPOLTSTEIN","MECKENHAUSEN",576127,3864,""]
[null,"HILPOLTSTEIN","MINDORF",576127,3866,""]
[null,"HILPOLTSTEIN","MÖRLACH",576127,3867,""]
[null,"HILPOLTSTEIN","PATERSHOLZ",576127,3876,""]
[null,"HILPOLTSTEIN","PIERHEIM",576127,3880,""]
[null,"HILPOLTSTEIN","SINDERSDORF",576127,3902,""]
[null,"HILPOLTSTEIN","SOLAR",576127,3903,{"$f":"+IF(A3138<>\"\",1,\"\")","v":""}]
[null,"HILPOLTSTEIN","TIEFENBACH",576127,3908,""]
[null,"HILPOLTSTEIN","UNTERRÖDEL",576127,3910,""]
[null,"HILPOLTSTEIN","WEINSFELD",576127,3915,""]
[null,"HILPOLTSTEIN","ZELL",576127,3919,""]
[null,"HILTENFINGEN","HILTENFINGEN",772157,7336,""]
[null,"HILTPOLTSTEIN","OBERTRUBACH",474138,2672,""]
[null,"HILTPOLTSTEIN","LILLING",474138,2693,""]
[null,"HILTPOLTSTEIN","SCHOSSARITZ",474138,2694,""]
[null,"HILTPOLTSTEIN","KAPPEL",474138,2695,""]
[null,"HILTPOLTSTEIN","HILTPOLTSTEIN",474138,2696,""]
[null,"HIMMELKRON","HIMMELKRONER FORST",477121,1777,""]
[null,"HIMMELKRON","HIMMELKRON",477121,1778,""]
[null,"HIMMELKRON","GÖSSENREUTH",477121,1779,""]
[null,"HIMMELKRON","LANZENDORF",477121,1780,""]
[null,"HIMMELSTADT","HIMMELSTADT",677142,652,""]
[null,"HINDELANG","HINDELANG",780123,7991,""]
[null,"HINDELANG","UNTERJOCH",780123,7992,""]
[null,"HINTERSCHMIDING","HERZOGSREUT",272126,5820,""]
[null,"HINTERSCHMIDING","HINTERSCHMIDING",272126,5849,""]
[null,"HIRSCHAID","ERLACH",471145,2154,""]
[null,"HIRSCHAID","FRIESEN",471145,2161,""]
[null,"HIRSCHAID","HIRSCHAID",471145,2190,""]
[null,"HIRSCHAID","RÖBERSDORF",471145,2270,""]
[null,"HIRSCHAID","ROTHENSAND",471145,2273,""]
[null,"HIRSCHAID","SASSANFAHRT",471145,2276,""]
[null,"HIRSCHAID","SEIGENDORF",471145,2284,""]
[null,"HIRSCHAU","MASSENRICHT",371127,4465,""]
[null,"HIRSCHAU","GROßSCHÖNBRUNN",371127,4475,""]
[null,"HIRSCHAU","EHENFELD",371127,4476,""]
[null,"HIRSCHAU","MIMBACH",371127,4489,""]
[null,"HIRSCHAU","HIRSCHAU",371127,4490,""]
[null,"HIRSCHAU","SCHARHOF",371127,4491,""]
[null,"HIRSCHAU","FORST",371127,4493,""]
[null,"HIRSCHAU","STEININGLOH",371127,4502,""]
[null,"HIRSCHAU","WEIHER",371127,4503,""]
[null,"HIRSCHBACH","ACHTEL",371128,4466,""]
[null,"HIRSCHBACH","ESCHENFELDEN",371128,4467,""]
[null,"HIRSCHBACH","HIRSCHBACH",371128,4477,""]
[null,"HIRSCHWALD","GARSDORF",371455,4547,""]
[null,"HITZHOFEN","HOFSTETTEN",176132,4039,""]
[null,"HITZHOFEN","OBERZELL",176132,4040,""]
[null,"HITZHOFEN","HITZHOFEN",176132,4041,""]
[null,"HÖCHBERG","HÖCHBERG",679147,705,""]
[null,"HÖCHHEIM","ROTHAUSEN",673134,57,""]
[null,"HÖCHHEIM","GOLLMUTHHAUSEN",673134,69,""]
[null,"HÖCHHEIM","HÖCHHEIM",673134,70,""]
[null,"HÖCHHEIM","IRMELSHAUSEN",673134,71,""]
[null,"HÖCHSTADT A.D.AISCH","BIENGARTEN",572135,2757,""]
[null,"HÖCHSTADT A.D.AISCH","BOXBRUNN",572135,2758,""]
[null,"HÖCHSTADT A.D.AISCH","ETZELSKIRCHEN",572135,2775,""]
[null,"HÖCHSTADT A.D.AISCH","GREUTH",572135,2785,""]
[null,"HÖCHSTADT A.D.AISCH","HÖCHSTADT A.D.AISCH",572135,2799,""]
[null,"HÖCHSTADT A.D.AISCH","SCHIRNSDORF",572135,2832,""]
[null,"HÖCHSTADT A.D.AISCH","SCHWARZENBACH",572135,2833,""]
[null,"HÖCHSTADT A.D.AISCH","STERPERSDORF",572135,2835,""]
[null,"HÖCHSTADT A.D.AISCH","ZENTBECHHOFEN",572135,2851,""]
[null,"HÖCHSTÄDT A.D.DONAU","SCHWENNENBACH",773139,6821,""]
[null,"HÖCHSTÄDT A.D.DONAU","OBERGLAUHEIM",773139,6822,""]
[null,"HÖCHSTÄDT A.D.DONAU","DEISENHOFEN",773139,6823,""]
[null,"HÖCHSTÄDT A.D.DONAU","HÖCHSTÄDT A.D.DONAU",773139,6824,""]
[null,"HÖCHSTÄDT A.D.DONAU","SONDERHEIM",773139,6825,""]
[null,"HOCHSTADT A.MAIN","HOCHSTADT A.MAIN",478127,1376,""]
[null,"HOCHSTADT A.MAIN","OBERSDORF",478127,1443,""]
[null,"HOCHSTADT A.MAIN","WOLFSLOCH",478127,1532,{"$f":"+IF(A3202<>\"\",1,\"\")","v":""}]
[null,"HÖCHSTÄDT-THIERSHEIM","NEUDES",479126,2034,""]
[null,"HÖCHSTÄDT-THIERSHEIM","HÖCHSTÄDT I.FICHTELGEBIRGE",479126,2038,""]
[null,"HOF","LEIMITZ",464000,1885,""]
[null,"HOF","HAIDT",464000,1886,""]
[null,"HOF","HOF",464000,1887,""]
[null,"HOF","UNTERKOTZAU",464000,1888,""]
[null,"HOF","HOFECK",464000,1889,""]
[null,"HOF","MOSCHENDORF",464000,1890,""]
[null,"HOF","WÖLBATTENDORF",464000,1891,""]
[null,"HOF","FÖHRENREUTH",464000,1892,""]
[null,"HOF","MARTINSREUTH",464000,1893,""]
[null,"HOF","HOF BERGWERK",464000,1991,""]
[null,"HOFHEIM I.UFR.","RECKERTSHAUSEN",674149,821,""]
[null,"HOFHEIM I.UFR.","EICHELSDORF",674149,822,""]
[null,"HOFHEIM I.UFR.","MANAU",674149,824,""]
[null,"HOFHEIM I.UFR.","SULZBACH",674149,825,""]
[null,"HOFHEIM I.UFR.","ERLSDORF",674149,826,""]
[null,"HOFHEIM I.UFR.","LENDERSHAUSEN",674149,836,""]
[null,"HOFHEIM I.UFR.","HOFHEIM I.UFR.",674149,837,""]
[null,"HOFHEIM I.UFR.","GOßMANNSDORF",674149,838,""]
[null,"HOFHEIM I.UFR.","RÜGHEIM",674149,850,""]
[null,"HOFHEIM I.UFR.","OSTHEIM",674149,851,""]
[null,"HOFKIRCHEN","HOFKIRCHEN",275127,6253,""]
[null,"HOFKIRCHEN","HILGARTSBERG",275127,6254,""]
[null,"HOFKIRCHEN","GARHAM",275127,6255,""]
[null,"HOFOLDINGER FORST","HOFOLDINGER FORST-NORD",184456,8719,""]
[null,"HOFOLDINGER FORST","HOFOLDINGER FORST-SÜD",184456,8721,""]
[null,"HOFSTETTEN","HAGENHEIM",181124,9022,""]
[null,"HOFSTETTEN","HOFSTETTEN",181124,9026,""]
[null,"HOHE BERG","ERLENBACH A.MAIN",676453,420,""]
[null,"HOHE WART","HOHE WART",676455,406,""]
[null,"HOHENALTHEIM","NIEDERALTHEIM",779162,6761,""]
[null,"HOHENALTHEIM","HOHENALTHEIM",779162,6762,""]
[null,"HOHENAU","SCHÖNBRUNN A.LUSEN",272127,5808,""]
[null,"HOHENAU","WASCHING",272127,5817,""]
[null,"HOHENAU","HOHENAU",272127,5818,""]
[null,"HOHENAU","KUMREUT",272127,5844,""]
[null,"HOHENBERG A.D.EGER","NEUHAUS A.D.EGER",479127,2039,""]
[null,"HOHENBERG A.D.EGER","HOHENBERG A.D.EGER",479127,2040,""]
[null,"HOHENBERGER FORST","HOHENBERGER FORST",479452,2028,""]
[null,"HOHENBRUNN","HOHENBRUNN",184129,8681,""]
[null,"HOHENBURG","RANSBACH",371129,4557,""]
[null,"HOHENBURG","ALLERSBURG",371129,4558,""]
[null,"HOHENBURG","THONHAUSEN",371129,4559,""]
[null,"HOHENBURG","HOHENBURG",371129,4560,""]
[null,"HOHENBURG","ADERTSHAUSEN",371129,4561,""]
[null,"HOHENBURG","MENDORFERBUCH",371129,4562,""]
[null,"HOHENBURG","EGELSHEIM",371129,4563,""]
[null,"HOHENBURG","TAUBENBACHER FORST",371129,4564,""]
[null,"HOHENFELS","GROßBISSENDORF",373134,5417,""]
[null,"HOHENFELS","HOHENFELS",373134,5418,""]
[null,"HOHENFELS","MARKSTETTEN",373134,5419,""]
[null,"HOHENFELS","RAITENBUCH",373134,5420,""]
[null,"HOHENFURCH","HOHENFURCH",190129,9089,""]
[null,"HOHENKAMMER","HOHENKAMMER",178133,8300,""]
[null,"HOHENKAMMER","SCHLIPPS",178133,8301,""]
[null,"HOHENKAMMER","LAUTERBACH",178133,8326,""]
[null,"HÖHENKIRCHEN","HÖHENKIRCHEN",184127,8679,""]
[null,"HÖHENKIRCHEN","SIEGERTSBRUNN",184127,8703,""]
[null,"HÖHENKIRCHENER FORST","HÖHENKIRCHENER FORST",184455,8718,""]
[null,"HOHENLINDEN","HOHENLINDEN",175123,8763,""]
[null,"HOHENLINDEN","EBERSBERGER FORST",175123,8783,""]
[null,"HOHENPEIßENBERG","HOHENPEIßENBERG",190130,9216,""]
[null,"HOHENPOLDING","SULDING",177121,8353,{"$f":"+IF(A3266<>\"\",1,\"\")","v":""}]
[null,"HOHENPOLDING","HOHENPOLDING",177121,8361,""]
[null,"HOHENROTH","BURGWALLBACHER FORST",673135,60,""]
[null,"HOHENROTH","STEINACHER FORST R.D.SAALE",673135,77,""]
[null,"HOHENROTH","WINDSHAUSEN",673135,78,""]
[null,"HOHENROTH","LEUTERSHAUSEN",673135,79,""]
[null,"HOHENROTH","HOHENROTH",673135,88,""]
[null,"HOHENTHANN","SCHMATZHAUSEN",274141,6565,""]
[null,"HOHENTHANN","OBERERGOLDSBACH",274141,6566,""]
[null,"HOHENTHANN","ANDERMANNSDORF",274141,6567,""]
[null,"HOHENTHANN","TÜRKENFELD",274141,6568,""]
[null,"HOHENTHANN","PETERSGLAIM",274141,6569,""]
[null,"HOHENTHANN","WEIHENSTEPHAN",274141,6570,""]
[null,"HOHENTHANN","WACHELKOFEN",274141,6571,""]
[null,"HOHENWART","FREINHAUSEN",186128,8181,""]
[null,"HOHENWART","DEIMHAUSEN",186128,8182,""]
[null,"HOHENWART","HOHENWART",186128,8183,""]
[null,"HOHENWART","HAIDFORST",186128,8184,""]
[null,"HOHENWART","KLOSTERBERG",186128,8185,""]
[null,"HOHENWART","WEICHENRIED",186128,8186,""]
[null,"HOHENWART","SEIBERSDORF",186128,8187,""]
[null,"HOHENWART","KOPPENBACH",186128,8188,""]
[null,"HOHENWARTH","ANSDORF",372135,5109,""]
[null,"HOHENWARTH","HOHENWARTH",372135,5110,""]
[null,"HOHENWARTH","GOTZENDORF",372135,5111,""]
[null,"HOHER BERG","HOHER BERG",676454,442,""]
[null,"HOLLENBACH","MAINBACH",771140,7429,""]
[null,"HOLLENBACH","SCHÖNBACH",771140,7430,""]
[null,"HOLLENBACH","HOLLENBACH",771140,7431,""]
[null,"HOLLENBACH","MOTZENHOFEN",771140,7432,""]
[null,"HOLLENBACH","IGENHAUSEN",771140,7433,""]
[null,"HOLLFELD","KRÖGELSTEIN",472154,2391,""]
[null,"HOLLFELD","WIESENTFELS",472154,2392,""]
[null,"HOLLFELD","FREIENFELS",472154,2393,""]
[null,"HOLLFELD","KAINACH",472154,2394,""]
[null,"HOLLFELD","WEIHER",472154,2395,""]
[null,"HOLLFELD","HOLLFELD",472154,2396,""]
[null,"HOLLFELD","SCHÖNFELD",472154,2397,""]
[null,"HOLLFELD","DROSENDORF A.D.AUFSEß",472154,2398,""]
[null,"HOLLFELD","TREPPENDORF",472154,2399,""]
[null,"HOLLFELD","STECHENDORF",472154,2400,""]
[null,"HOLLFELD","HOCHSTAHL",472154,2404,""]
[null,"HOLLSTADT","HOLLSTADT",673136,65,""]
[null,"HOLLSTADT","JUNKERSHAUSEN",673136,66,""]
[null,"HOLLSTADT","WARGOLSHAUSEN",673136,67,""]
[null,"HOLZGÜNZ","SCHWAIGHAUSEN",778151,7575,""]
[null,"HOLZGÜNZ","HOLZGÜNZ",778151,7576,""]
[null,"HOLZHEIM (LKR. DLG)","WEISINGEN",773140,6895,""]
[null,"HOLZHEIM (LKR. DLG)","ALTENBAINDT",773140,6896,""]
[null,"HOLZHEIM (LKR. DLG)","HOLZHEIM",773140,6897,""]
[null,"HOLZHEIM (LKR. DLG)","ELLERBACH",773140,6898,""]
[null,"HOLZHEIM (LKR. DLG)","EPPISBURG",773140,6899,""]
[null,"HOLZHEIM (LKR. DON)","PESSENBURGHEIM",779163,6971,""]
[null,"HOLZHEIM (LKR. DON)","STADEL",779163,6972,""]
[null,"HOLZHEIM (LKR. DON)","BERGENDORF",779163,6973,""]
[null,"HOLZHEIM (LKR. DON)","HOLZHEIM",779163,6974,""]
[null,"HOLZHEIM (LKR. DON)","RIEDHEIM",779163,6975,""]
[null,"HOLZHEIM (LKR. NU)","HOLZHEIM",775126,7068,""]
[null,"HOLZHEIM (LKR. NU)","NEUHAUSEN",775126,7069,""]
[null,"HOLZHEIM A.FORST","BUBACH A.FORST",375153,5464,""]
[null,"HOLZHEIM A.FORST","HOLZHEIM A.FORST",375153,5465,""]
[null,"HOLZKIRCHEN (LKR. MB)","HARTPENNING",182120,9502,""]
[null,"HOLZKIRCHEN (LKR. MB)","HOLZKIRCHEN",182120,9503,""]
[null,"HOLZKIRCHEN (LKR. MB)","FÖCHING",182120,9504,""]
[null,"HOLZKIRCHEN (LKR. WÜ)","WÜSTENZELL",679149,690,{"$f":"+IF(A3330<>\"\",1,\"\")","v":""}]
[null,"HOLZKIRCHEN (LKR. WÜ)","HOLZKIRCHEN",679149,691,""]
[null,"HOPFERAU","HOPFERAU",777135,7903,""]
[null,"HORGAU","AUERBACH",772159,7246,""]
[null,"HORGAU","HORGAU",772159,7247,""]
[null,"HORGAU","HORGAUERGREUT",772159,7248,""]
[null,"HÖRGERTSHAUSEN","GRAFENDORF",178132,8255,""]
[null,"HÖRGERTSHAUSEN","AIRISCHWAND",178132,8265,""]
[null,"HÖRGERTSHAUSEN","MARGARETHENRIED",178132,8269,""]
[null,"HÖRGERTSHAUSEN","HÖRGERTSHAUSEN",178132,8271,""]
[null,"HÖRGERTSHAUSEN","ENGHAUSEN",178132,8272,""]
[null,"HÖSBACH","WENIGHÖSBACH",671130,349,""]
[null,"HÖSBACH","FELDKAHL",671130,350,""]
[null,"HÖSBACH","ROTTENBERG",671130,351,""]
[null,"HÖSBACH","HÖSBACH",671130,364,""]
[null,"HÖSBACH","WINZENHOHL",671130,370,""]
[null,"HÖSLWANG","HÖSLWANG",187145,9638,""]
[null,"HÖTTINGEN","HÖTTINGEN",577141,3713,""]
[null,"HÖTTINGEN","FIEGENSTALL",577141,3714,""]
[null,"HÖTTINGEN","WEIBOLDSHAUSEN",577141,3715,""]
[null,"HUCKELHEIMER WALD","HUCKELHEIM",671454,304,""]
[null,"HUGLFING","HUGLFING",190131,9225,""]
[null,"HUISHEIM","GOSHEIM",779167,6775,""]
[null,"HUISHEIM","HUISHEIM",779167,6776,""]
[null,"HUMMELTAL","PITTERSDORF",472155,2465,""]
[null,"HUMMELTAL","PETTENDORF",472155,2466,""]
[null,"HUMMELTAL","CREEZ",472155,2467,""]
[null,"HUMMELTAL","HINTERKLEEBACH",472155,2468,""]
[null,"HUNDELSHAUSEN","HUNDELSHAUSEN",678453,1022,""]
[null,"HUNDERDORF","GAISHAUSEN",278139,5597,""]
[null,"HUNDERDORF","STEINBURG",278139,5598,""]
[null,"HUNDERDORF","AU VORM WALD",278139,5599,""]
[null,"HUNDERDORF","HUNDERDORF",278139,5609,""]
[null,"HUNDING","HUNDING",271126,5923,""]
[null,"HURLACH","HURLACH",181126,9028,""]
[null,"HUTTHURM","MÜNCHEN",275128,6305,""]
[null,"HUTTHURM","PRAG",275128,6306,""]
[null,"HUTTHURM","HUTTHURM",275128,6307,""]
[null,"HUTTHURM","LEOPRECHTING",275128,6308,""]
[null,"ICHENHAUSEN","RIEDEN A.D.KÖTZ",774143,7149,""]
[null,"ICHENHAUSEN","HOCHWANG",774143,7150,""]
[null,"ICHENHAUSEN","DEUBACH",774143,7151,""]
[null,"ICHENHAUSEN","AUTENRIED",774143,7152,""]
[null,"ICHENHAUSEN","OXENBRONN",774143,7153,""]
[null,"ICHENHAUSEN","ICHENHAUSEN",774143,7154,""]
[null,"ICHENHAUSEN","ROHRER WALD",774143,7166,""]
[null,"ICKING","ICKING",173130,9309,""]
[null,"ICKING","DORFEN",173130,9310,""]
[null,"IFFELDORF","IFFELDORF",190132,9215,""]
[null,"IGENSDORF","POMMER",474140,2697,""]
[null,"IGENSDORF","DACHSTADT",474140,2698,""]
[null,"IGENSDORF","IGENSDORF",474140,2699,""]
[null,"IGENSDORF","STÖCKACH",474140,2700,""]
[null,"IGENSDORF","PETTENSIEDEL",474140,2701,""]
[null,"IGENSDORF","RÜSSELBACH",474140,2702,""]
[null,"IGGENSBACH","IGGENSBACH",271127,5951,""]
[null,"IGLING","HOLZHAUSEN B.BUCHLOE",181127,9027,""]
[null,"IGLING","OBERIGLING",181127,9041,""]
[null,"IGLING","UNTERIGLING",181127,9070,""]
[null,"IHRLERSTEIN","EINWALD",273133,6021,""]
[null,"IHRLERSTEIN","NEUKELHEIM",273133,6062,""]
[null,"IHRLERSTEIN","WALDDORF",273133,6104,""]
[null,"ILLERTISSEN","AU",775129,7508,""]
[null,"ILLERTISSEN","BETLINSHAUSEN",775129,7509,""]
[null,"ILLERTISSEN","TIEFENBACH",775129,7510,{"$f":"+IF(A3394<>\"\",1,\"\")","v":""}]
[null,"ILLERTISSEN","ILLERTISSEN",775129,7511,""]
[null,"ILLERTISSEN","JEDESHEIM",775129,7512,""]
[null,"ILLESHEIM","ILLESHEIM",575133,2976,""]
[null,"ILLESHEIM","URFERSHEIM",575133,3051,""]
[null,"ILLESHEIM","WESTHEIM",575133,3062,""]
[null,"ILLSCHWANG","BACHETSFELD",371131,4496,""]
[null,"ILLSCHWANG","AUGSBERG",371131,4507,""]
[null,"ILLSCHWANG","ANGFELD",371131,4508,""]
[null,"ILLSCHWANG","ILLSCHWANG",371131,4509,""]
[null,"ILLSCHWANG","DIETERSBERG",371131,4511,""]
[null,"ILLSCHWANG","GÖTZENDORF",371131,4530,""]
[null,"ILMMÜNSTER","ILMMÜNSTER",186130,8236,""]
[null,"ILMMÜNSTER","ILMRIED",186130,8237,""]
[null,"IMMENREUTH","AHORNBERG",377127,4214,""]
[null,"IMMENREUTH","PUNREUTH",377127,4215,""]
[null,"IMMENREUTH","IMMENREUTH",377127,4216,""]
[null,"IMMENSTADT I.ALLGÄU","DIEPOLZ",780124,7969,""]
[null,"IMMENSTADT I.ALLGÄU","AKAMS",780124,7970,""]
[null,"IMMENSTADT I.ALLGÄU","ECKARTS",780124,7971,""]
[null,"IMMENSTADT I.ALLGÄU","STEIN I.ALLGÄU",780124,7972,""]
[null,"IMMENSTADT I.ALLGÄU","BÜHL A.ALPSEE",780124,7973,""]
[null,"IMMENSTADT I.ALLGÄU","IMMENSTADT I.ALLGÄU",780124,7974,""]
[null,"IMMENSTADT I.ALLGÄU","UNTERMAISELSTEIN",780124,7975,""]
[null,"IMMENSTADT I.ALLGÄU","RAUHENZELL",780124,7993,""]
[null,"INCHENHOFEN","OBERBACHERN",771141,7426,""]
[null,"INCHENHOFEN","SAINBACH",771141,7427,""]
[null,"INCHENHOFEN","INCHENHOFEN",771141,7428,""]
[null,"INGENRIED","INGENRIED",190133,9090,""]
[null,"INGOLSTADT","INGOLSTADT, BERGWERKE",161000,8000,""]
[null,"INGOLSTADT","GAIMERSHEIM",161000,8028,""]
[null,"INGOLSTADT","ETTING",161000,8049,""]
[null,"INGOLSTADT","OBERHAUNSTADT",161000,8050,""]
[null,"INGOLSTADT","PETTENHOFEN",161000,8051,""]
[null,"INGOLSTADT","IRGERTSHEIM",161000,8052,""]
[null,"INGOLSTADT","MÜHLHAUSEN",161000,8053,""]
[null,"INGOLSTADT","DÜNZLAU",161000,8054,""]
[null,"INGOLSTADT","GEROLFING",161000,8055,""]
[null,"INGOLSTADT","INGOLSTADT",161000,8056,""]
[null,"INGOLSTADT","MAILING",161000,8057,""]
[null,"INGOLSTADT","UNSERNHERRN",161000,8058,""]
[null,"INGOLSTADT","HAGAU",161000,8059,""]
[null,"INGOLSTADT","BRUNNENREUTH",161000,8060,""]
[null,"INGOLSTADT","ZUCHERING",161000,8061,""]
[null,"INGOLSTADT","WINDEN",161000,8062,""]
[null,"INNERNZELL","GMÜND",272128,5823,""]
[null,"INNERNZELL","HILGENREITH",272128,5831,""]
[null,"INNERNZELL","INNERNZELL",272128,5832,""]
[null,"INNING A.AMMERSEE","INNING A.AMMERSEE",188126,9154,""]
[null,"INNING A.AMMERSEE","BUCH A.AMMERSEE",188126,9159,""]
[null,"INNING A.HOLZ","INNING A.HOLZ",177122,8365,""]
[null,"INSINGEN","INSINGEN",571169,2977,""]
[null,"INSINGEN","LOHR",571169,2992,""]
[null,"INZELL","INZELL",189124,9880,""]
[null,"IPHOFEN","IPHOFEN",675139,1187,""]
[null,"IPHOFEN","BIRKLINGEN",675139,1188,""]
[null,"IPHOFEN","POSSENHEIM",675139,1208,""]
[null,"IPHOFEN","MÖNCHSONDHEIM",675139,1221,""]
[null,"IPHOFEN","HELLMITZHEIM",675139,1222,""]
[null,"IPHOFEN","ALTMANNSHAUSEN",675139,1223,""]
[null,"IPHOFEN","NENZENHEIM",675139,1239,""]
[null,"IPHOFEN","DORNHEIM",675139,1240,""]
[null,"IPHOFEN","LIMPURGERFORST",675139,1241,""]
[null,"IPHOFEN","ALTMANNSHAUSEN NORDWEST",675139,1255,""]
[null,"IPPESHEIM","BULLENHEIM",575134,2919,{"$f":"+IF(A3458<>\"\",1,\"\")","v":""}]
[null,"IPPESHEIM","HERRNBERCHTHEIM",575134,2972,""]
[null,"IPPESHEIM","IPPESHEIM",575134,2978,""]
[null,"IPSHEIM","EICHELBERG",575135,2937,""]
[null,"IPSHEIM","IPSHEIM",575135,2979,""]
[null,"IPSHEIM","KAUBENHEIM",575135,2980,""]
[null,"IPSHEIM","MAILHEIM",575135,2993,""]
[null,"IPSHEIM","OBERNDORF",575135,3008,""]
[null,"IRCHENRIETH","IRCHENRIETH",374127,4401,""]
[null,"IRLBACH","AMSELFING",278140,5627,""]
[null,"IRLBACH","IRLBACH",278140,5642,""]
[null,"IRSCHENBERG","REICHERSDORF",182123,9511,""]
[null,"IRSCHENBERG","IRSCHENBERG",182123,9512,""]
[null,"IRSCHENBERG","PARSBERG",182123,9515,""]
[null,"IRSCHENBERG","NIKLASREUTH",182123,9516,""]
[null,"IRSEE","IRSEE",777139,7846,""]
[null,"IRTENBERGER WALD","IRTENBERGER WALD",679453,714,""]
[null,"ISEN","ISEN",177123,8401,""]
[null,"ISEN","WESTACH",177123,8402,""]
[null,"ISEN","SOLLACHER FORST",177123,8403,""]
[null,"ISEN","MITTBACH",177123,8411,""]
[null,"ISEN","SCHNAUPPING",177123,8412,""]
[null,"ISEN","THONBACH",177123,8413,""]
[null,"ISMANING","ISMANING",184130,8682,""]
[null,"ISSIGAU","ISSIGAU",475137,1861,""]
[null,"ISSIGAU","EICHENSTEIN",475137,1862,""]
[null,"ISSIGAU","KEMLAS",475137,1863,""]
[null,"ISSIGAU","REITZENSTEIN",475137,1864,""]
[null,"ITZGRUND","GLEUßEN",473138,1359,""]
[null,"ITZGRUND","HERRETH",473138,1375,""]
[null,"ITZGRUND","KALTENBRUNN",473138,1382,""]
[null,"ITZGRUND","LAHM",473138,1397,""]
[null,"ITZGRUND","SCHOTTENSTEIN",473138,1474,""]
[null,"ITZGRUND","WELSBERG",473138,1524,""]
[null,"JACHENAU","JACHENAU",173131,9417,""]
[null,"JANDELSBRUNN","HINTEREBEN",272129,5867,""]
[null,"JANDELSBRUNN","JANDELSBRUNN",272129,5878,""]
[null,"JANDELSBRUNN","HEINDLSCHLAG",272129,5885,""]
[null,"JENGEN","WEICHT",777140,7828,""]
[null,"JENGEN","JENGEN",777140,7829,""]
[null,"JENGEN","BECKSTETTEN",777140,7830,""]
[null,"JENGEN","UMMENHOFEN",777140,7831,""]
[null,"JENGEN","EURISHOFEN",777140,7832,""]
[null,"JENGEN","KETTERSCHWANG",777140,7847,""]
[null,"JENGEN","WEINHAUSEN",777140,7920,""]
[null,"JESENWANG","JESENWANG",179130,8477,""]
[null,"JESENWANG","PFAFFENHOFEN",179130,8478,""]
[null,"JETTENBACH","JETTENBACH",183122,8855,""]
[null,"JETTINGEN-SCHEPPACH","ETTENBEURER WALD",774144,7165,""]
[null,"JETTINGEN-SCHEPPACH","SCHEPPACH",774144,7171,""]
[null,"JETTINGEN-SCHEPPACH","JETTINGEN",774144,7172,""]
[null,"JETTINGEN-SCHEPPACH","FREIHALDEN",774144,7173,""]
[null,"JETTINGEN-SCHEPPACH","RIED B.JETTINGEN",774144,7174,""]
[null,"JETTINGEN-SCHEPPACH","SCHÖNENBERG",774144,7175,""]
[null,"JETZENDORF","TRIEFING",186132,8213,""]
[null,"JETZENDORF","STEINKIRCHEN",186132,8242,""]
[null,"JETZENDORF","HIRSCHENHAUSEN",186132,8243,""]
[null,"JETZENDORF","VOLKERSDORF",186132,8244,""]
[null,"JETZENDORF","JETZENDORF",186132,8245,""]
[null,"JOHANNESBERG","RÜCKERSBACH",671133,343,""]
[null,"JOHANNESBERG","OBERAFFERBACH",671133,345,""]
[null,"JOHANNESBERG","JOHANNESBERG",671133,346,""]
[null,"JOHANNESBERG","BREUNSBERG",671133,347,""]
[null,"JOHANNESBERG","STEINBACH",671133,353,""]
[null,"JOHANNISKIRCHEN","DUMMELDORF",277126,6408,{"$f":"+IF(A3522<>\"\",1,\"\")","v":""}]
[null,"JOHANNISKIRCHEN","EMMERSDORF",277126,6411,""]
[null,"JOHANNISKIRCHEN","JOHANNISKIRCHEN",277126,6426,""]
[null,"JOHANNISKIRCHEN","MITTERHAUSEN",277126,6441,""]
[null,"JULBACH","JULBACH",277127,6519,""]
[null,"KACHELSTEIN U.BAUMBURGER WALD","KACHELSTEIN U.BAUMBURGER WALD",189453,9869,""]
[null,"KAHL A.MAIN","KAHL A.MAIN",671134,321,""]
[null,"KAISERHAMMER FORST-OST","KAISERHAMMER FORST-OST",479453,2029,""]
[null,"KAISHEIM","SULZDORF",779169,6934,""]
[null,"KAISHEIM","GUNZENHEIM",779169,6935,""]
[null,"KAISHEIM","KAISHEIM",779169,6936,""]
[null,"KAISHEIM","HAFENREUT",779169,6937,""]
[null,"KAISHEIM","LEITHEIM",779169,6938,""]
[null,"KAISHEIM","ALTISHEIM",779169,6939,""]
[null,"KÄLBERBERG","Zeitlofs",672458,194,""]
[null,"KALCHREUTH","KALCHREUTH",572137,2803,""]
[null,"KALCHREUTH","RÖCKENHOF",572137,2829,""]
[null,"KALCHREUTHER FORST","KALCHREUTHER FORST",572457,2804,""]
[null,"KALLMÜNZ","DINAU",375156,5456,""]
[null,"KALLMÜNZ","DALLACKENRIED",375156,5457,""]
[null,"KALLMÜNZ","ROHRBACH",375156,5458,""]
[null,"KALLMÜNZ","TRAIDENDORF",375156,5459,""]
[null,"KALLMÜNZ","EICH",375156,5460,""]
[null,"KALLMÜNZ","KALLMÜNZ",375156,5461,""]
[null,"KALLMÜNZ","FISCHBACH",375156,5462,""]
[null,"KALLMÜNZ","KRACHENHAUSEN",375156,5463,""]
[null,"KALTENTAL","BLONHOFEN",777141,7858,""]
[null,"KALTENTAL","AUFKIRCH",777141,7859,""]
[null,"KALTENTAL","FRANKENHOFEN",777141,7860,""]
[null,"KAMMELTAL","HAMMERSTETTEN",774145,7159,""]
[null,"KAMMELTAL","WETTENHAUSEN",774145,7160,""]
[null,"KAMMELTAL","KLEINBEUREN",774145,7161,""]
[null,"KAMMELTAL","GALGENFORST",774145,7162,""]
[null,"KAMMELTAL","GOLDBACH",774145,7163,""]
[null,"KAMMELTAL","ETTENBEUREN",774145,7164,""]
[null,"KAMMELTAL","ETTENBEURER WALD",774145,7165,""]
[null,"KAMMELTAL","ROHRER WALD",774145,7166,""]
[null,"KAMMELTAL","UNTERROHR",774145,7167,""]
[null,"KAMMELTAL","EGENHOFEN",774145,7168,""]
[null,"KAMMELTAL","BEHLINGEN",774145,7169,""]
[null,"KAMMELTAL","RIED B.BEHLINGEN",774145,7170,""]
[null,"KAMMERSTEIN","BARTHELMESAURACH",576128,3809,""]
[null,"KAMMERSTEIN","GÜNZERSREUTH",576128,3834,""]
[null,"KAMMERSTEIN","KAMMERSTEIN",576128,3848,""]
[null,"KAMMERSTEIN","UNTERREICHENBACH",576128,3912,""]
[null,"KAMMLACH","UNTERKAMMLACH",778180,7775,""]
[null,"KAMMLACH","OBERKAMMLACH",778180,7776,""]
[null,"KARBACH","KARBACH",677146,594,""]
[null,"KARLSFELD","KARLSFELD",174126,8624,""]
[null,"KARLSHULD","GRASHEIM",185139,8093,""]
[null,"KARLSHULD","KARLSHULD",185139,8094,""]
[null,"KARLSKRON","KARLSKRON",185140,8095,""]
[null,"KARLSKRON","POBENHAUSEN",185140,8096,""]
[null,"KARLSKRON","ADELSHAUSEN",185140,8097,""]
[null,"KARLSTADT","WIESENFELD",677148,562,""]
[null,"KARLSTADT","ROHRBACH",677148,565,""]
[null,"KARLSTADT","GAINFURTER MARKUNG",677148,566,""]
[null,"KARLSTADT","GAMBACH",677148,567,""]
[null,"KARLSTADT","KARLBURG",677148,568,""]
[null,"KARLSTADT","MÜHLBACH",677148,569,""]
[null,"KARLSTADT","KARLSTADT",677148,570,""]
[null,"KARLSTADT","LAUDENBACH",677148,571,""]
[null,"KARLSTADT","HEßLAR",677148,572,""]
[null,"KARLSTADT","STETTEN",677148,573,""]
[null,"KARLSTADT","STADELHOFEN",677148,579,{"$f":"+IF(A3586<>\"\",1,\"\")","v":""}]
[null,"KARLSTEIN A.MAIN","GROßWELZHEIM",671114,332,""]
[null,"KARLSTEIN A.MAIN","DETTINGEN A.MAIN",671114,342,""]
[null,"KARSBACH","WEYERSFELD",677149,518,""]
[null,"KARSBACH","Höllrich",677149,520,""]
[null,"KARSBACH","HEßDORF",677149,531,""]
[null,"KARSBACH","KARSBACH",677149,532,""]
[null,"KASENDORF","LOPP",477124,1781,""]
[null,"KASENDORF","PEESTEN",477124,1782,""]
[null,"KASENDORF","DÖLLNITZ",477124,1783,""]
[null,"KASENDORF","AZENDORF",477124,1784,""]
[null,"KASENDORF","KASENDORF",477124,1785,""]
[null,"KASENDORF","HEUBSCH",477124,1786,""]
[null,"KASENDORF","SCHIRRADORF",477124,1788,""]
[null,"KASTL (LKR. AÖ)","FORSTKASTL",171121,8912,""]
[null,"KASTL (LKR. AÖ)","OBERKASTL",171121,8926,""]
[null,"KASTL (LKR. AÖ)","UNTERKASTL",171121,8940,""]
[null,"KASTL (LKR. AÖ)","ALTÖTTINGER FORST",171121,8946,""]
[null,"KASTL (LKR. AS)","LEITEN U.SCHOTTENBÜHL",371132,4528,""]
[null,"KASTL (LKR. AS)","WOLFSFELD",371132,4529,""]
[null,"KASTL (LKR. AS)","PFAFFENHOFEN",371132,4542,""]
[null,"KASTL (LKR. AS)","KASTL",371132,4543,""]
[null,"KASTL (LKR. AS)","WINKL",371132,4544,""]
[null,"KASTL (LKR. AS)","HAUSEN",371132,4545,""]
[null,"KASTL (LKR. AS)","UTZENHOFEN",371132,4556,""]
[null,"KASTL (LKR. TIR)","REUTH B.KASTL",377128,4237,""]
[null,"KASTL (LKR. TIR)","WOLFRAMSHOF",377128,4238,""]
[null,"KASTL (LKR. TIR)","KASTL",377128,4239,""]
[null,"KASTL (LKR. TIR)","UNTERBRUCK",377128,4240,""]
[null,"KAUFBEUREN","KLEINKEMNAT",762000,7866,""]
[null,"KAUFBEUREN","KAUFBEUREN",762000,7867,""]
[null,"KAUFBEUREN","OBERBEUREN",762000,7868,""]
[null,"KAUFBEUREN","HIRSCHZELL",762000,7869,""]
[null,"KAUFERING","KAUFERING",181128,9031,""]
[null,"KELHEIM","AFFECKING",273137,6003,""]
[null,"KELHEIM","FRAUENFORST",273137,6022,""]
[null,"KELHEIM","GRONSDORF",273137,6025,""]
[null,"KELHEIM","HERRNSAAL",273137,6032,""]
[null,"KELHEIM","HIENHEIMER FORST",273137,6035,""]
[null,"KELHEIM","KAPFELBERG",273137,6042,""]
[null,"KELHEIM","KELHEIM",273137,6043,""]
[null,"KELHEIM","KELHEIMWINZER",273137,6044,""]
[null,"KELHEIM","LOHSTADT",273137,6051,""]
[null,"KELHEIM","STAUBING",273137,6094,""]
[null,"KELHEIM","STAUSACKER",273137,6095,""]
[null,"KELHEIM","THALDORF",273137,6099,""]
[null,"KELHEIM","WELTENBURG",273137,6105,""]
[null,"KELLMÜNZ A.D.ILLER","KELLMÜNZ A.D.ILLER",775132,7526,""]
[null,"KEMMERN","KEMMERN",471150,2200,""]
[null,"KEMNATH","KÖTZERSDORF",377129,4222,""]
[null,"KEMNATH","BERNDORF",377129,4223,""]
[null,"KEMNATH","SCHLACKENHOF",377129,4224,""]
[null,"KEMNATH","HÖFLAS",377129,4225,""]
[null,"KEMNATH","KEMNATH",377129,4226,""]
[null,"KEMNATH","EISERSDORF",377129,4227,""]
[null,"KEMNATH","SCHÖNREUTH",377129,4228,""]
[null,"KEMNATH","WALDECK",377129,4229,""]
[null,"KEMNATH","ZWERGAU",377129,4230,""]
[null,"KEMNATH","FORTSCHAU",377129,4231,""]
[null,"KEMNATH","KAIBITZ",377129,4232,""]
[null,"KEMNATH","LÖSCHWITZ",377129,4233,""]
[null,"KEMNATH","ATZMANNSBERG",377129,4234,""]
[null,"KEMNATH","GUTTENBERG",377129,4235,""]
[null,"KEMNATH","TIEFENBACH",377129,4236,""]
[null,"KEMNATH","KEMNATH, BERGWERKE",377129,4285,{"$f":"+IF(A3650<>\"\",1,\"\")","v":""}]
[null,"KEMPTEN (ALLGÄU)","KEMPTEN (ALLGÄU)",763000,7670,""]
[null,"KEMPTEN (ALLGÄU)","SANKT LORENZ",763000,7671,""]
[null,"KEMPTEN (ALLGÄU)","SANKT MANG",763000,7672,""]
[null,"KEMPTER WALD","KEMPTER WALD",780451,7675,""]
[null,"KETTERSHAUSEN","TAFERTSHOFEN",778221,7530,""]
[null,"KETTERSHAUSEN","ZAIERTSHOFEN",778221,7531,""]
[null,"KETTERSHAUSEN","MOHRENHAUSEN",778221,7532,""]
[null,"KETTERSHAUSEN","KETTERSHAUSEN",778221,7533,""]
[null,"KETTERSHAUSEN","BEBENHAUSEN",778221,7534,""]
[null,"KIEFERSFELDEN","KIEFERSFELDEN",187148,9642,""]
[null,"KIENBERG","KIENBERG",189126,9812,""]
[null,"KINDING","HAUNSTETTEN",176137,3978,""]
[null,"KINDING","BADANHAUSEN",176137,3979,""]
[null,"KINDING","KIRCHANHAUSEN",176137,3980,""]
[null,"KINDING","ERLINGSHOFEN",176137,3981,""]
[null,"KINDING","BERLETZHAUSEN",176137,3982,""]
[null,"KINDING","ENKERING",176137,3983,""]
[null,"KINDING","KINDING",176137,3984,""]
[null,"KINDING","PFRAUNDORF",176137,3985,""]
[null,"KINDING","UNTEREMMENDORF",176137,3986,""]
[null,"KINDING","SCHAFHAUSEN",176137,3987,""]
[null,"KINDING","ILBLING",176137,3988,""]
[null,"KINSAU","KINSAU",181129,9032,""]
[null,"KIPFENBERG","HIRNSTETTEN",176138,3989,""]
[null,"KIPFENBERG","PFAHLDORF",176138,3990,""]
[null,"KIPFENBERG","KIPFENBERG",176138,3991,""]
[null,"KIPFENBERG","KEMATHEN",176138,3992,""]
[null,"KIPFENBERG","IRLAHÜLL",176138,3993,""]
[null,"KIPFENBERG","OBEREMMENDORF",176138,3994,""]
[null,"KIPFENBERG","BUCH",176138,3995,""]
[null,"KIPFENBERG","GRÖSDORF",176138,3996,""]
[null,"KIPFENBERG","BÖHMING",176138,3997,""]
[null,"KIPFENBERG","ARNSBERG",176138,3998,""]
[null,"KIPFENBERG","SCHAMBACH",176138,3999,""]
[null,"KIPFENBERG","ATTENZELL",176138,4000,""]
[null,"KIPFENBERG","KRUT",176138,4001,""]
[null,"KIPFENBERG","DUNSDORF",176138,4002,""]
[null,"KIPFENBERG","BIBERG",176138,4003,""]
[null,"KIPFENBERG","SCHELLDORF",176138,4004,""]
[null,"KIRCHANSCHÖRING","LAMPODING",189127,9913,""]
[null,"KIRCHANSCHÖRING","KIRCHANSCHÖRING",189127,9914,""]
[null,"KIRCHBERG","KIRCHBERG",177124,8352,""]
[null,"KIRCHBERG I.WALD","ZELL",276126,5755,""]
[null,"KIRCHBERG I.WALD","REICHERTSRIED",276126,5756,""]
[null,"KIRCHBERG I.WALD","KIRCHBERG I.WALD",276126,5758,""]
[null,"KIRCHBERG I.WALD","RAINDORF",276126,5761,""]
[null,"KIRCHDORF (LKR KELHEIM)","KIRCHDORF (LKR KELHEIM)",273139,6045,""]
[null,"KIRCHDORF (LKR MÜHLDORF)","KIRCHDORF (LKR MÜHLDORF)",183123,9711,""]
[null,"KIRCHDORF (LKR MÜHLDORF)","FÜRHOLZEN",183123,9712,""]
[null,"KIRCHDORF (LKR MÜHLDORF)","BERG",183123,9713,""]
[null,"KIRCHDORF A.D.AMPER","TÜNZHAUSEN",178136,8304,""]
[null,"KIRCHDORF A.D.AMPER","KIRCHDORF A.D.AMPER",178136,8305,""]
[null,"KIRCHDORF A.D.AMPER","WIPPENHAUSEN",178136,8306,""]
[null,"KIRCHDORF A.INN","KIRCHDORF A.INN",277128,6520,""]
[null,"KIRCHDORF I.WALD","SCHLAG",276127,5759,""]
[null,"KIRCHDORF I.WALD","KIRCHDORF I.WALD",276127,5760,""]
[null,"KIRCHDORF I.WALD","ABTSCHLAG",276127,5762,""]
[null,"KIRCHEHRENBACH","KIRCHEHRENBACH",474143,2662,""]
[null,"KIRCHENDEMENREUTH","OED",374128,4307,""]
[null,"KIRCHENDEMENREUTH","ALTENPARKSTEIN",374128,4310,""]
[null,"KIRCHENDEMENREUTH","KIRCHENDEMENREUTH",374128,4311,""]
[null,"KIRCHENDEMENREUTH","DÖLTSCH",374128,4312,""]
[null,"KIRCHENDEMENREUTH","WENDERSREUTH",374128,4313,""]
[null,"KIRCHENDEMENREUTH","KLOBENREUTH",374128,4314,{"$f":"+IF(A3714<>\"\",1,\"\")","v":""}]
[null,"KIRCHENLAMITZ","HALLERSTEINER FORST-NORDOST",479129,2017,""]
[null,"KIRCHENLAMITZ","UNTERSCHIEDA",479129,2018,""]
[null,"KIRCHENLAMITZ","DÖRFLAS B.KIRCHENLAMITZ",479129,2019,""]
[null,"KIRCHENLAMITZ","KIRCHENLAMITZ",479129,2020,""]
[null,"KIRCHENLAMITZ","NIEDERLAMITZ",479129,2021,""]
[null,"KIRCHENLAMITZ","RAUMETENGRÜN",479129,2022,""]
[null,"KIRCHENLAMITZ","REICHOLDSGRÜN",479129,2023,""]
[null,"KIRCHENLAMITZ","MARTINLAMITZER FORST-SÜD",479129,2024,""]
[null,"KIRCHENLAMITZ","HALLERSTEINER FORST-SÜD",479129,2025,""]
[null,"KIRCHENPINGARTEN","KIRCHENPINGARTEN",472156,2455,""]
[null,"KIRCHENPINGARTEN","LIENLAS",472156,2456,""]
[null,"KIRCHENPINGARTEN","REISLAS",472156,2457,""]
[null,"KIRCHENPINGARTEN","TRESSAU",472156,2458,""]
[null,"KIRCHENSITTENBACH","ALGERSDORF",574135,3503,""]
[null,"KIRCHENSITTENBACH","ASPERTSHOFEN",574135,3507,""]
[null,"KIRCHENSITTENBACH","KIRCHENSITTENBACH",574135,3544,""]
[null,"KIRCHENSITTENBACH","KLEEDORF",574135,3546,""]
[null,"KIRCHENSITTENBACH","OBERKRUMBACH",574135,3554,""]
[null,"KIRCHENSITTENBACH","TREUF",574135,3577,""]
[null,"KIRCHENSITTENBACH","WALLSDORF",574135,3583,""]
[null,"KIRCHENTHUMBACH","HEINERSREUTH",374129,4241,""]
[null,"KIRCHENTHUMBACH","THURNDORF",374129,4242,""]
[null,"KIRCHENTHUMBACH","SASSENREUTH",374129,4243,""]
[null,"KIRCHENTHUMBACH","NEUZIRKENDORF",374129,4244,""]
[null,"KIRCHENTHUMBACH","TREINREUTH",374129,4245,""]
[null,"KIRCHENTHUMBACH","KIRCHENTHUMBACH",374129,4246,""]
[null,"KIRCHENTHUMBACH","FRONLOHE",374129,4247,""]
[null,"KIRCHENTHUMBACH","METZENHOF",374129,4248,""]
[null,"KIRCHHAM","KIRCHHAM",275130,6533,""]
[null,"KIRCHHASLACH","OLGISHOFEN",778157,7535,""]
[null,"KIRCHHASLACH","HERRETSHOFEN",778157,7536,""]
[null,"KIRCHHASLACH","KIRCHHASLACH",778157,7537,""]
[null,"KIRCHHASLACH","GREIMELTSHOFEN",778157,7538,""]
[null,"KIRCHHEIM","KIRCHHEIM",679153,732,""]
[null,"KIRCHHEIM","GAUBÜTTELBRUNN",679153,746,""]
[null,"KIRCHHEIM B.MÜNCHEN","HEIMSTETTEN",184131,8678,""]
[null,"KIRCHHEIM B.MÜNCHEN","KIRCHHEIM B.MÜNCHEN",184131,8683,""]
[null,"KIRCHHEIM I.SCHW.","HASBERG",778158,7744,""]
[null,"KIRCHHEIM I.SCHW.","DERNDORF",778158,7745,""]
[null,"KIRCHHEIM I.SCHW.","TIEFENRIED",778158,7746,""]
[null,"KIRCHHEIM I.SCHW.","KIRCHHEIM I.SCHW.",778158,7747,""]
[null,"KIRCHHEIM I.SCHW.","SPÖCK",778158,7748,""]
[null,"KIRCHLAUTER","PETTSTADT",674160,907,""]
[null,"KIRCHLAUTER","NEUBRUNN",674160,924,""]
[null,"KIRCHLAUTER","KIRCHLAUTER",674160,925,""]
[null,"KIRCHROTH","STADLDORF",278141,5583,""]
[null,"KIRCHROTH","NIEDERACHDORF",278141,5584,""]
[null,"KIRCHROTH","PILLNACH",278141,5585,""]
[null,"KIRCHROTH","OBERMIETHNACH",278141,5586,""]
[null,"KIRCHROTH","PONDORF",278141,5592,""]
[null,"KIRCHROTH","OBERZEITLDORN",278141,5593,""]
[null,"KIRCHROTH","KIRCHROTH",278141,5594,""]
[null,"KIRCHROTH","PITTRICH",278141,5605,""]
[null,"KIRCHROTH","KÖßNACH",278141,5606,""]
[null,"KIRCHSEEON","KIRCHSEEON",175124,8764,""]
[null,"KIRCHSEEON","EGLHARTINGER FORST",175124,8784,""]
[null,"KIRCHWEIDACH","KIRCHWEIDACH",171122,8918,""]
[null,"KIRCHWEIDACH","NEUKIRCHEN A.D.ALZ",171122,8922,""]
[null,"KIRCHZELL","WATTERBACH",676131,474,""]
[null,"KIRCHZELL","KIRCHZELL",676131,475,""]
[null,"KIRCHZELL","OTTORFSZELL",676131,476,""]
[null,"KIRCHZELL","PREUNSCHEN",676131,477,""]
[null,"KISSING","KISSING",771142,7381,""]
[null,"KIST","IRTENBERGER WALD",679154,714,{"$f":"+IF(A3778<>\"\",1,\"\")","v":""}]
[null,"KIST","KIST",679154,715,""]
[null,"KITZINGEN","KLOSTERFORST",675141,1151,""]
[null,"KITZINGEN","REPPERNDORF",675141,1166,""]
[null,"KITZINGEN","KITZINGEN",675141,1168,""]
[null,"KITZINGEN","HOHENFELD",675141,1181,""]
[null,"KITZINGEN","SICKERSHAUSEN",675141,1182,""]
[null,"KITZINGEN","HOHEIM",675141,1183,""]
[null,"KLAUSWALD-SÜD","KLAUSWALD-SÜD",672460,232,""]
[null,"KLEINAITINGEN","KLEINAITINGEN",772160,7324,""]
[null,"KLEINHEUBACH","KLEINHEUBACH",676132,451,""]
[null,"KLEINKAHL","GROßLAUDENBACH",671135,314,""]
[null,"KLEINKAHL","KLEINLAUDENBACH",671135,315,""]
[null,"KLEINKAHL","KLEINKAHL",671135,316,""]
[null,"KLEINKAHL","GROßKAHL",671135,317,""]
[null,"KLEINKAHL","EDELBACH",671135,318,""]
[null,"KLEINLANGHEIM","ATZHAUSEN",675142,1141,""]
[null,"KLEINLANGHEIM","HAIDT",675142,1153,""]
[null,"KLEINLANGHEIM","KLEINLANGHEIM",675142,1154,""]
[null,"KLEINOSTHEIM","KLEINOSTHEIM",671136,360,""]
[null,"KLEINRINDERFELD","KLEINRINDERFELD",679155,719,""]
[null,"KLEINSENDELBACH","KLEINSENDELBACH",474144,2711,""]
[null,"KLEINWALLSTADT","KLEINWALLSTADT",676133,410,""]
[null,"KLEINWALLSTADT","HOFSTETTEN",676133,417,""]
[null,"KLINGENBERG A.MAIN","KLINGENBERG A.MAIN",676134,432,""]
[null,"KLINGENBERG A.MAIN","TRENNFURT",676134,445,""]
[null,"KLINGENBERG A.MAIN","RÖLLFELD",676134,446,""]
[null,"KLINGENBRUNNER WALD","KLINGENBRUNN",272454,5802,""]
[null,"KLOSTERLECHFELD","UNTERMEITINGEN",772162,7331,""]
[null,"KNETZGAU","HAINERT",674163,961,""]
[null,"KNETZGAU","KNETZGAU",674163,962,""]
[null,"KNETZGAU","WOHNAU",674163,985,""]
[null,"KNETZGAU","UNTERSCHWAPPACH",674163,986,""]
[null,"KNETZGAU","OBERSCHWAPPACH",674163,987,""]
[null,"KNETZGAU","ESCHENAU",674163,988,""]
[null,"KNETZGAU","WESTHEIM",674163,989,""]
[null,"KNETZGAU","ZELL A.EBERSBERG",674163,990,""]
[null,"KNETZGAU","NEUHAUSER FORST",674163,1006,""]
[null,"KOCHEL A.SEE","KOCHEL A.SEE",173133,9416,""]
[null,"KÖDITZ","KÖDITZ",475141,1874,""]
[null,"KÖDITZ","SCHLEGEL",475141,1875,""]
[null,"KÖDITZ","JODITZ",475141,1876,""]
[null,"KÖDITZ","BRUNNENTHAL",475141,1877,""]
[null,"KÖDNITZ","KULMBACHER FORST",477127,1757,""]
[null,"KÖDNITZ","KAUERNDORF",477127,1764,""]
[null,"KÖDNITZ","KÖDNITZ",477127,1765,""]
[null,"KÖFERING","KÖFERING",375161,5273,""]
[null,"KOHLBERG","RÖTHENBACH",374131,4388,""]
[null,"KOHLBERG","THANNHOF",374131,4390,""]
[null,"KOHLBERG","KOHLBERG",374131,4391,""]
[null,"KOHLBERG","HANNERSGRÜN",374131,4392,""]
[null,"KOLBERMOOR","HARTHAUSEN",187150,9629,""]
[null,"KOLBERMOOR","KOLBERMOOR",187150,9644,""]
[null,"KOLBERMOOR","PANG",187150,9657,""]
[null,"KOLITZHEIM","GERNACH",678150,1000,""]
[null,"KOLITZHEIM","UNTERSPIESHEIM",678150,1001,""]
[null,"KOLITZHEIM","OBERSPIESHEIM",678150,1002,""]
[null,"KOLITZHEIM","LINDACH",678150,1015,""]
[null,"KOLITZHEIM","KOLITZHEIM",678150,1016,""]
[null,"KOLITZHEIM","HERLHEIM",678150,1017,""]
[null,"KOLITZHEIM","STAMMHEIM",678150,1033,""]
[null,"KOLITZHEIM","ZEILITZHEIM",678150,1034,""]
[null,"KOLLENBERGER FORST","KOLLENBERGER FORST",676456,438,""]
[null,"KOLLNBURG","RECHERTSRIED",276128,5719,""]
[null,"KOLLNBURG","KOLLNBURG",276128,5720,{"$f":"+IF(A3842<>\"\",1,\"\")","v":""}]
[null,"KOLLNBURG","KIRCHAITNACH",276128,5722,""]
[null,"KOLLNBURG","ALLERSDORF",276128,5723,""]
[null,"KÖLLNHOLZ","KÖLLNHOLZ",473454,1391,""]
[null,"KÖNIGSBERG I.BAYERN","JUNKERSDORF",674164,864,""]
[null,"KÖNIGSBERG I.BAYERN","UNFINDEN",674164,865,""]
[null,"KÖNIGSBERG I.BAYERN","HOLZHAUSEN",674164,878,""]
[null,"KÖNIGSBERG I.BAYERN","RÖMERSHOFEN",674164,880,""]
[null,"KÖNIGSBERG I.BAYERN","HELLINGEN",674164,881,""]
[null,"KÖNIGSBERG I.BAYERN","KÖNIGSBERG I.BAY.",674164,882,""]
[null,"KÖNIGSBERG I.BAYERN","HOFSTETTEN",674164,883,""]
[null,"KÖNIGSBERG I.BAYERN","ALTERSHAUSEN",674164,903,""]
[null,"KÖNIGSBERG I.BAYERN","WINDBERGER FORST",674164,904,""]
[null,"KÖNIGSBERG I.BAYERN","KOTTENBRUNN",674164,905,""]
[null,"KÖNIGSBERG I.BAYERN","KÖSLAU",674164,906,""]
[null,"KÖNIGSBERG I.BAYERN","DÖRFLIS",674164,923,""]
[null,"KÖNIGSBRUNN","KÖNIGSBRUNN",772163,7309,""]
[null,"KÖNIGSDORF","KÖNIGSDORF",173134,9336,""]
[null,"KÖNIGSDORF","OSTERHOFEN",173134,9337,""]
[null,"KÖNIGSDORF","SCHÖNRAIN",173134,9338,""]
[null,"KÖNIGSFELD","HUPPENDORF",471151,2196,""]
[null,"KÖNIGSFELD","KÖNIGSFELD",471151,2203,""]
[null,"KÖNIGSFELD","POXDORF",471151,2256,""]
[null,"KÖNIGSFELD","TREUNITZ",471151,2311,""]
[null,"KÖNIGSFELD","VOITMANNSDORF",471151,2326,""]
[null,"KÖNIGSMOOS","UNTERMAXFELD",185163,8091,""]
[null,"KÖNIGSMOOS","LUDWIGSMOOS",185163,8092,""]
[null,"KÖNIGSMOOS","SANDIZELL",185163,8099,""]
[null,"KÖNIGSMOOS","BERG IM GAU",185163,8105,""]
[null,"KÖNIGSMOOS","LANGENMOSEN",185163,8109,""]
[null,"KÖNIGSTEIN","KÖNIGSTEIN",371135,4451,""]
[null,"KÖNIGSTEIN","GAIßACH",371135,4452,""]
[null,"KÖNIGSTEIN","KÜRMREUTH",371135,4453,""]
[null,"KÖNIGSTEIN","NAMSREUTH",371135,4454,""]
[null,"KÖNIGSTEIN","SIGRAS",371135,4455,""]
[null,"KONNERSREUTH","KONDRAU",377131,4102,""]
[null,"KONNERSREUTH","KONNERSREUTH",377131,4103,""]
[null,"KONNERSREUTH","PLEUßEN",377131,4114,""]
[null,"KONNERSREUTH","PECHBRUNN",377131,4116,""]
[null,"KONRADSREUTH","FÖHRENREUTH",475142,1892,""]
[null,"KONRADSREUTH","MARTINSREUTH",475142,1893,""]
[null,"KONRADSREUTH","KONRADSREUTH",475142,1894,""]
[null,"KONRADSREUTH","SILBERBACH",475142,1895,""]
[null,"KONRADSREUTH","GOTTFRIEDSREUTH",475142,1896,""]
[null,"KONRADSREUTH","MARKERSREUTH",475142,1897,""]
[null,"KONRADSREUTH","AHORNBERG",475142,1898,""]
[null,"KONZELL","GOSSERSDORF",278143,5555,""]
[null,"KONZELL","AUGGENBACH",278143,5558,""]
[null,"KONZELL","KONZELL",278143,5559,""]
[null,"KOPPENWINDER FORST","EBRACH",471456,2147,""]
[null,"KÖSCHING","BETTBRUNN",176139,8029,""]
[null,"KÖSCHING","KASING",176139,8030,""]
[null,"KÖSCHING","KÖSCHING",176139,8031,""]
[null,"KÖßLARN","THANHAM",275131,6521,""]
[null,"KÖßLARN","KÖßLARN",275131,6522,""]
[null,"KÖßLARN","HUBREITH",275131,6523,""]
[null,"KOTTGEISERING","KOTTGEISERING",179131,8492,""]
[null,"KÖTZ","GROßKÖTZ",774148,7143,""]
[null,"KÖTZ","KLEINKÖTZ",774148,7144,""]
[null,"KÖTZ","EBERSBACH",774148,7145,""]
[null,"KÖTZTING","LIEBENSTEIN",372137,5165,""]
[null,"KÖTZTING","HAUS",372137,5166,""]
[null,"KÖTZTING","GEHSTORF",372137,5167,""]
[null,"KÖTZTING","KÖTZTING",372137,5168,""]
[null,"KÖTZTING","ARNDORF",372137,5169,{"$f":"+IF(A3906<>\"\",1,\"\")","v":""}]
[null,"KÖTZTING","WEIßENREGEN",372137,5170,""]
[null,"KÖTZTING","TRAIDERSDORF",372137,5171,""]
[null,"KÖTZTING","SACKENRIED",372137,5172,""]
[null,"KÖTZTING","WETTZELL",372137,5173,""]
[null,"KRAFTISRIED","KRAFTISRIED",777144,7878,""]
[null,"KRAFTSHOFER FORST","KRAFTSHOFER FORST",572458,2810,""]
[null,"KRAIBURG A.INN","MAXIMILIAN",183124,8856,""]
[null,"KRAIBURG A.INN","KRAIBURG A.INN",183124,8857,""]
[null,"KRAIBURG A.INN","GUTTENBURG",183124,8858,""]
[null,"KRAILLING","KRAILLING",188127,9153,""]
[null,"KRAILLING","FROHNLOH",188127,9158,""]
[null,"KRANZBERG","TÜNZHAUSEN",178137,8304,""]
[null,"KRANZBERG","WIPPENHAUSEN",178137,8306,""]
[null,"KRANZBERG","THALHAUSEN",178137,8307,""]
[null,"KRANZBERG","KRANZBERG",178137,8308,""]
[null,"KRANZBERG","HOHENBERCHA",178137,8309,""]
[null,"KRANZBERG","GREMERTSHAUSEN",178137,8310,""]
[null,"KRAUSENBACHER FORST","KRAUSENBACHER FORST",671455,393,""]
[null,"KREUTH","KREUTH",182124,9425,""]
[null,"KREUTHER FORST","KREUTH",375452,5274,""]
[null,"KREUZWERTHEIM","RÖTTBACH",677151,604,""]
[null,"KREUZWERTHEIM","WIEBELBACH",677151,606,""]
[null,"KREUZWERTHEIM","KREUZWERTHEIM",677151,607,""]
[null,"KREUZWERTHEIM","UNTERWITTBACH",677151,608,""]
[null,"KROMBACH","KROMBACH",671138,327,""]
[null,"KRONACH","GLOSBERG",476145,1603,""]
[null,"KRONACH","GUNDELSDORF",476145,1604,""]
[null,"KRONACH","KNELLENDORF",476145,1605,""]
[null,"KRONACH","FRIESEN",476145,1606,""]
[null,"KRONACH","DÖRFLES",476145,1607,""]
[null,"KRONACH","ROTSCHREUTH",476145,1608,""]
[null,"KRONACH","SEELACH",476145,1609,""]
[null,"KRONACH","GEHÜLZ",476145,1610,""]
[null,"KRONACH","KRONACH",476145,1611,""]
[null,"KRONACH","DOBERSGRUND",476145,1612,""]
[null,"KRONACH","ZIEGELERDEN",476145,1613,""]
[null,"KRONACH","NEUSES",476145,1614,""]
[null,"KRONACH","VOGTENDORF",476145,1615,""]
[null,"KRONACH","HÖFLES",476145,1616,""]
[null,"KRONACH","FISCHBACH",476145,1617,""]
[null,"KRONACH","WÖTZELSDORF",476145,1618,""]
[null,"KRONBURG","KARDORF",778161,7598,""]
[null,"KRONBURG","KRONBURG",778161,7599,""]
[null,"KRÖNING","DIETELSKIRCHEN",274145,6625,""]
[null,"KRÖNING","KRÖNING",274145,6626,""]
[null,"KRÖNING","JESENDORF",274145,6627,""]
[null,"KRUMBACH I.SCHWABEN","BILLENHAUSEN",774150,7717,""]
[null,"KRUMBACH I.SCHWABEN","EDENHAUSEN",774150,7718,""]
[null,"KRUMBACH I.SCHWABEN","ATTENHAUSEN",774150,7719,""]
[null,"KRUMBACH I.SCHWABEN","KRUMBACH (SCHWABEN)",774150,7720,""]
[null,"KRUMBACH I.SCHWABEN","HÜRBEN",774150,7721,""]
[null,"KRUMBACH I.SCHWABEN","NIEDERRAUNAU",774150,7722,""]
[null,"KRUMBACH I.SCHWABEN","HOHENRAUNAU",774150,7723,""]
[null,"KRUMMENNAAB","THUMSENREUTH",377132,4138,""]
[null,"KRUMMENNAAB","KRUMMENNAAB",377132,4139,""]
[null,"KRUMMENNAAB","SASSENHOF",377132,4140,""]
[null,"KRUMMENNAAB","TRAUTENBERG",377132,4141,""]
[null,"KRUMMENNAAB","REUTH B.ERBENDORF",377132,4143,""]
[null,"KRÜN","KRÜN",180122,9258,""]
[null,"KÜHBACH","UNTERBERNBACH",771144,7434,""]
[null,"KÜHBACH","STOCKENSAU",771144,7435,""]
[null,"KÜHBACH","HASLANGKREIT",771144,7436,""]
[null,"KÜHBACH","KÜHBACH",771144,7437,""]
[null,"KÜHBACH","OBERSCHÖNBACH",771144,7438,{"$f":"+IF(A3970<>\"\",1,\"\")","v":""}]
[null,"KÜHLENTHAL","KÜHLENTHAL",772166,6990,""]
[null,"KULMAIN","LENAU",377133,4217,""]
[null,"KULMAIN","OBERBRUCK",377133,4218,""]
[null,"KULMAIN","KULMAIN",377133,4219,""]
[null,"KULMAIN","ZINST",377133,4220,""]
[null,"KULMAIN","OBERWAPPENÖST",377133,4221,""]
[null,"KULMBACH","KIRCHLEUS",477128,1744,""]
[null,"KULMBACH","LÖSAU",477128,1745,""]
[null,"KULMBACH","LEHENTHAL",477128,1746,""]
[null,"KULMBACH","OBERDORNLACH",477128,1747,""]
[null,"KULMBACH","ZIEGELHÜTTENER FORST",477128,1748,""]
[null,"KULMBACH","HÖFERÄNGER",477128,1749,""]
[null,"KULMBACH","BURGHAIG",477128,1750,""]
[null,"KULMBACH","METZDORF",477128,1751,""]
[null,"KULMBACH","BLAICH",477128,1752,""]
[null,"KULMBACH","KAUERNBURG",477128,1753,""]
[null,"KULMBACH","KULMBACH",477128,1754,""]
[null,"KULMBACH","MELKENDORF",477128,1755,""]
[null,"KULMBACH","MANGERSREUTH",477128,1756,""]
[null,"KULMBACH","KULMBACHER FORST",477128,1757,""]
[null,"KULMBACH","KATSCHENREUTH",477128,1758,""]
[null,"KULMBACH","LEUCHAU",477128,1759,""]
[null,"KULMBACH","KULMBACH, BERGWERK",477128,1836,""]
[null,"KUMHAUSEN","NIEDERKAM",274146,6645,""]
[null,"KUMHAUSEN","GÖTZDORF",274146,6646,""]
[null,"KUMHAUSEN","HOHENEGGLKOFEN",274146,6647,""]
[null,"KUMHAUSEN","OBERGANGKOFEN",274146,6648,""]
[null,"KUMHAUSEN","WINDTEN",274146,6649,""]
[null,"KÜMMERSBRUCK","KÖFERING",371136,4536,""]
[null,"KÜMMERSBRUCK","THEUERN",371136,4537,""]
[null,"KÜMMERSBRUCK","GÄRMERSDORF",371136,4539,""]
[null,"KUNREUTH","OBEREHRENBACH",474145,2665,""]
[null,"KUNREUTH","KUNREUTH",474145,2683,""]
[null,"KUNREUTH","ERMREUS",474145,2684,""]
[null,"KÜNZING","LANGENAMMING",271128,5970,""]
[null,"KÜNZING","FORSTHART",271128,5974,""]
[null,"KÜNZING","KÜNZING",271128,5975,""]
[null,"KUPFERBERG","KUPFERBERG",477129,1762,""]
[null,"KÜPS","THEISENORT",476146,1642,""]
[null,"KÜPS","SCHMÖLZ",476146,1643,""]
[null,"KÜPS","JOHANNISTHAL",476146,1644,""]
[null,"KÜPS","TÜSCHNITZ",476146,1645,""]
[null,"KÜPS","AU",476146,1646,""]
[null,"KÜPS","OBERLANGENSTADT",476146,1647,""]
[null,"KÜPS","KÜPS",476146,1648,""]
[null,"KÜPS","BURKERSDORF",476146,1649,""]
[null,"KÜPS","HAIN",476146,1650,""]
[null,"KÜRNACH","KÜRNACH",679156,689,""]
[null,"KUTZENHAUSEN","KUTZENHAUSEN",772167,7274,""]
[null,"KUTZENHAUSEN","AGAWANG",772167,7275,""]
[null,"KUTZENHAUSEN","ROMMELSRIED",772167,7276,""]
[null,"KUTZENHAUSEN","BUCH",772167,7277,""]
[null,"KUTZENHAUSEN","REITENBUCH",772167,7299,""]
[null,"KUTZENHAUSEN","MAINGRÜNDEL",772167,7337,""]
[null,"LAABER","ENDORF",375162,5470,""]
[null,"LAABER","BERGSTETTEN",375162,5471,""]
[null,"LAABER","GROßETZENBERG",375162,5472,""]
[null,"LAABER","LAABER",375162,5473,""]
[null,"LAABER","HAAG",375162,5485,""]
[null,"LABERWEINTING","ALLKOFEN",278144,5631,""]
[null,"LABERWEINTING","GRAFENTRAUBACH",278144,5648,""]
[null,"LABERWEINTING","LABERWEINTING",278144,5649,""]
[null,"LABERWEINTING","HOFKIRCHEN",278144,5662,""]
[null,"LABERWEINTING","HAADER",278144,5663,{"$f":"+IF(A4034<>\"\",1,\"\")","v":""}]
[null,"LABERWEINTING","OBERELLENBACH",278144,5671,""]
[null,"LACHEN","LACHEN",778162,7580,""]
[null,"LALLING","LALLING",271130,5922,""]
[null,"LAM","ENGELSHÜTT",372138,5115,""]
[null,"LAM","LAM",372138,5116,""]
[null,"LAMERDINGEN","LAMERDINGEN",777145,7821,""]
[null,"LAMERDINGEN","KLEINKITZIGHOFEN",777145,7822,""]
[null,"LAMERDINGEN","GROßKITZIGHOFEN",777145,7823,""]
[null,"LAMERDINGEN","DILLISHAUSEN",777145,7824,""]
[null,"LANDAU A.D.ISAR","KAMMERN",279122,6162,""]
[null,"LANDAU A.D.ISAR","FRAMMERING",279122,6171,""]
[null,"LANDAU A.D.ISAR","HÖCKING",279122,6172,""]
[null,"LANDAU A.D.ISAR","LANDAU A.D.ISAR",279122,6173,""]
[null,"LANDAU A.D.ISAR","METTENHAUSEN",279122,6174,""]
[null,"LANDAU A.D.ISAR","REICHERSDORF",279122,6175,""]
[null,"LANDAU A.D.ISAR","ZEHOLFING",279122,6176,""]
[null,"LANDENSBERG","GLÖTTWENG",774151,7132,""]
[null,"LANDENSBERG","LANDENSBERG",774151,7133,""]
[null,"LANDSBERG A.LECH","ELLIGHOFEN",181130,9013,""]
[null,"LANDSBERG A.LECH","ERPFTING",181130,9018,""]
[null,"LANDSBERG A.LECH","LANDSBERG A.LECH",181130,9033,""]
[null,"LANDSBERG A.LECH","PITZLING",181130,9050,""]
[null,"LANDSBERG A.LECH","REISCH",181130,9055,""]
[null,"LANDSBERIED","LANDSBERIED",179132,8479,""]
[null,"LANDSHUT","ERGOLDING",261000,6588,""]
[null,"LANDSHUT","OHU",261000,6594,""]
[null,"LANDSHUT","WOLFSBACH",261000,6605,""]
[null,"LANDSHUT","ALTDORF",261000,6615,""]
[null,"LANDSHUT","MÜNCHNERAU",261000,6616,""]
[null,"LANDSHUT","LANDSHUT",261000,6617,""]
[null,"LANDSHUT","ACHDORF",261000,6618,""]
[null,"LANDSHUT","BERG OB LANDSHUT",261000,6619,""]
[null,"LANDSHUT","SCHÖNBRUNN",261000,6620,""]
[null,"LANDSHUT","FRAUENBERG",261000,6621,""]
[null,"LANDSHUT","NIEDERKAM",261000,6645,""]
[null,"LANDSHUT","GÖTZDORF",261000,6646,""]
[null,"LANDSHUT","HOHENEGGLKOFEN",261000,6647,""]
[null,"LANDSHUT","LANDSHUT BLAU",261000,6681,""]
[null,"LANDSHUT","LANDSHUT GELB",261000,6682,""]
[null,"LANDSHUT","LANDSHUT ROT",261000,6683,""]
[null,"LANDSHUT","LANDSHUT WEIß",261000,6684,""]
[null,"LANGDORF","LANGDORF",276129,5729,""]
[null,"LANGDORF","BRANDTEN",276129,5730,""]
[null,"LANGENALTHEIM","REHLINGEN",577148,3765,""]
[null,"LANGENALTHEIM","BÜTTELBRONN",577148,3766,""]
[null,"LANGENALTHEIM","LANGENALTHEIM",577148,3767,""]
[null,"LANGENALTHEIM","OBERHOLZ",577148,3768,""]
[null,"LANGENBACH","LANGENBACH",178138,8311,""]
[null,"LANGENBACH","OBERHUMMEL",178138,8312,""]
[null,"LANGENBACH","RUDLFING",178138,8314,""]
[null,"LANGENBACHER FORST","LANGENBACHER FORST",476453,1591,""]
[null,"LANGENFELD","LANGENFELD",575138,1254,""]
[null,"LANGENMOSEN","MALZHAUSEN",185143,8108,""]
[null,"LANGENMOSEN","LANGENMOSEN",185143,8109,""]
[null,"LANGENNEUFNACH","LANGENNEUFNACH",772168,7310,""]
[null,"LANGENNEUFNACH","HABERTSWEILER",772168,7311,""]
[null,"LANGENPREISING","LANGENPREISING",177126,8351,""]
[null,"LANGENPROZELTENER FORST","LANGENPROZELTENER FORST",677459,527,""]
[null,"LANGENSENDELBACH","LANGENSENDELBACH",474146,2688,""]
[null,"LANGENZENN","LANGENZENN",573120,3325,""]
[null,"LANGENZENN","LAUBENDORF",573120,3326,""]
[null,"LANGENZENN","KIRCHFEMBACH",573120,3327,""]
[null,"LANGENZENN","HORBACH",573120,3328,""]
[null,"LANGENZENN","KEIDENZELL",573120,3329,{"$f":"+IF(A4098<>\"\",1,\"\")","v":""}]
[null,"LANGERRINGEN","LANGERRINGEN",772170,7333,""]
[null,"LANGERRINGEN","GENNACH",772170,7334,""]
[null,"LANGERRINGEN","SCHWABMÜHLHAUSEN",772170,7335,""]
[null,"LANGFURTH","LANGFURTH",571170,3651,""]
[null,"LANGFURTH","AMMELBRUCH",571170,3652,""]
[null,"LANGFURTH","DORFKEMMATHEN",571170,3653,""]
[null,"LANGQUAID","ADLHAUSEN",273141,6002,""]
[null,"LANGQUAID","GRUB",273141,6028,""]
[null,"LANGQUAID","HERRNGIERSDORF",273141,6031,""]
[null,"LANGQUAID","LANGQUAID",273141,6047,""]
[null,"LANGQUAID","NIEDERLEIERNDORF",273141,6064,""]
[null,"LANGQUAID","PARING",273141,6074,""]
[null,"LANGQUAID","SCHNEIDHART",273141,6090,""]
[null,"LANGWEID A.LECH","LANGWEID A.LECH",772171,7227,""]
[null,"LANGWEID A.LECH","ACHSHEIM",772171,7228,""]
[null,"LANGWEID A.LECH","STETTENHOFEN",772171,7229,""]
[null,"LANGWEILER WALD","LANGWEILER WALD",472459,2482,""]
[null,"LAPPERSDORF","HAINSACKER",375165,5255,""]
[null,"LAPPERSDORF","KARETH",375165,5268,""]
[null,"LAPPERSDORF","LAPPERSDORF",375165,5279,""]
[null,"LAPPERSDORF","SCHWAIGHAUSER FORST",375165,5329,""]
[null,"LAUBEN (LKR. MN)","LAUBEN",778163,7555,""]
[null,"LAUBEN (LKR. MN)","FRICKENHAUSEN",778163,7556,""]
[null,"LAUBEN (LKR. OA)","LAUBEN",780125,7662,""]
[null,"LAUDENBACH","LAUDENBACH",676135,449,""]
[null,"LAUF A.D.PEGNITZ","BEERBACH",574138,3508,""]
[null,"LAUF A.D.PEGNITZ","BULLACH",574138,3512,""]
[null,"LAUF A.D.PEGNITZ","DEHNBERG",574138,3513,""]
[null,"LAUF A.D.PEGNITZ","GÜNTHERSBÜHL",574138,3525,""]
[null,"LAUF A.D.PEGNITZ","HEUCHLING",574138,3536,""]
[null,"LAUF A.D.PEGNITZ","LAUF A.D.PEGNITZ",574138,3550,""]
[null,"LAUF A.D.PEGNITZ","NEUNHOF",574138,3552,""]
[null,"LAUF A.D.PEGNITZ","OEDENBERG",574138,3556,""]
[null,"LAUF A.D.PEGNITZ","SCHÖNBERG",574138,3570,""]
[null,"LAUF A.D.PEGNITZ","SIMONSHOFEN",574138,3574,""]
[null,"LAUF A.D.PEGNITZ","VELDERSHOF",574138,3580,""]
[null,"LAUF A.D.PEGNITZ","WEIGENHOFEN",574138,3584,""]
[null,"LAUF A.D.PEGNITZ","WETZENDORF",574138,3585,""]
[null,"LAUFACH","LAUFACH",671139,357,""]
[null,"LAUFACH","HAIN I.SPESSART",671139,358,""]
[null,"LAUFACH","FORST HAIN I.SPESSART",671139,365,""]
[null,"LAUFAMHOLZER FORST","LAUFAMHOLZER FORST",574460,3485,""]
[null,"LAUFEN","WIEDMAIS",172122,9919,""]
[null,"LAUFEN","LAUFEN",172122,9920,""]
[null,"LAUFEN","LEOBENDORF",172122,9921,""]
[null,"LAUFEN","HEINING",172122,9922,""]
[null,"LAUFEN","TRIEBENBACH",172122,9923,""]
[null,"LAUGNA","LAUGNA",773143,6889,""]
[null,"LAUGNA","BOCKSBERG",773143,6890,""]
[null,"LAUGNA","OSTERBUCH",773143,6891,""]
[null,"LAUINGEN A.D.DONAU","FRAUENRIEDHAUSEN",773144,6856,""]
[null,"LAUINGEN A.D.DONAU","VEITRIEDHAUSEN",773144,6857,""]
[null,"LAUINGEN A.D.DONAU","LAUINGEN (DONAU)",773144,6858,""]
[null,"LAUINGEN A.D.DONAU","FAIMINGEN",773144,6859,""]
[null,"LAUTER","APPENDORF",471152,2107,""]
[null,"LAUTER","DEUSDORF",471152,2136,""]
[null,"LAUTER","LAUTER",471152,2210,""]
[null,"LAUTERHOFEN","BRUNN",373140,4607,""]
[null,"LAUTERHOFEN","DEINSCHWANG",373140,4611,""]
[null,"LAUTERHOFEN","ENGELSBERG",373140,4615,""]
[null,"LAUTERHOFEN","GEBERTSHOFEN",373140,4622,""]
[null,"LAUTERHOFEN","GRAFENBUCHER FORST",373140,4624,""]
[null,"LAUTERHOFEN","LAUTERHOFEN",373140,4641,""]
[null,"LAUTERHOFEN","PETTENHOFEN",373140,4665,{"$f":"+IF(A4162<>\"\",1,\"\")","v":""}]
[null,"LAUTERHOFEN","TRAUNFELD",373140,4696,""]
[null,"LAUTERHOFEN","TRAUTMANNSHOFEN",373140,4697,""]
[null,"LAUTERTAL","NEUKIRCHEN",473141,1428,""]
[null,"LAUTERTAL","OBERLAUTER",473141,1442,""]
[null,"LAUTERTAL","ROTTENBACH",473141,1465,""]
[null,"LAUTERTAL","TIEFENLAUTER",473141,1495,""]
[null,"LAUTERTAL","TREMERSDORF",473141,1497,""]
[null,"LAUTERTAL","UNTERLAUTER",473141,1505,""]
[null,"LAUTRACH","LAUTRACH",778164,7600,""]
[null,"LECHBRUCK","LECHBRUCK AM SEE",777147,7904,""]
[null,"LEGAU","MARIA STEINBACH",778165,7601,""]
[null,"LEGAU","LEGAU",778165,7602,""]
[null,"LEHRBERG","BRÜNST",571171,3120,""]
[null,"LEHRBERG","GRÄFENBUCH",571171,3146,""]
[null,"LEHRBERG","HEßBACH",571171,3160,""]
[null,"LEHRBERG","LEHRBERG",571171,3177,""]
[null,"LEHRBERG","OBERSULZBACH",571171,3203,""]
[null,"LEIBLFING","HAINSBACH",278146,5651,""]
[null,"LEIBLFING","METTING",278146,5652,""]
[null,"LEIBLFING","ESCHLBACH",278146,5653,""]
[null,"LEIBLFING","SCHWIMMBACH",278146,5664,""]
[null,"LEIBLFING","LEIBLFING",278146,5665,""]
[null,"LEIBLFING","OBERSUNZING",278146,5666,""]
[null,"LEIBLFING","HANKOFEN",278146,5667,""]
[null,"LEIBLFING","HAILING",278146,5672,""]
[null,"LEIDERSBACH","EBERSBACH",676136,404,""]
[null,"LEIDERSBACH","LEIDERSBACH",676136,405,""]
[null,"LEIDERSBACH","VOLKERSBRUNN",676136,408,""]
[null,"LEIDERSBACH","ROßBACH",676136,412,""]
[null,"LEINACH","UNTERLEINACH",679200,663,""]
[null,"LEINACH","OBERLEINACH",679200,664,""]
[null,"LEINBURG","LEINBURG",574461,3442,""]
[null,"LEINBURG (LKR. RH)","BRUNN",574139,3406,""]
[null,"LEINBURG (LKR. RH)","DIEPERSDORF",574139,3409,""]
[null,"LEINBURG (LKR. RH)","ENTENBERG",574139,3414,""]
[null,"LEINBURG (LKR. RH)","GERSDORF",574139,3422,""]
[null,"LEINBURG (LKR. RH)","LEINBURG",574139,3442,""]
[null,"LEINBURG (LKR. RH)","OBERHAIDELBACH",574139,3452,""]
[null,"LEINBURG (LKR. RH)","UNTERHAIDELBACH",574139,3474,""]
[null,"LEINBURG (LKR. RH)","WEIßENBRUNN",574139,3475,""]
[null,"LEIPHEIM","RIEDHEIM",774155,7104,""]
[null,"LEIPHEIM","LEIPHEIM",774155,7105,""]
[null,"LENAUER FORST","LENAU",377455,4217,""]
[null,"LENGDORF","MATZBACH",177127,8382,""]
[null,"LENGDORF","LENGDORF",177127,8392,""]
[null,"LENGENWANG","LENGENWANG",777149,7895,""]
[null,"LENGGRIES","LENGGRIES",173135,9418,""]
[null,"LENTING","LENTING",176143,8026,""]
[null,"LEONBERG","LEONBERG",377137,4118,""]
[null,"LEONBERG","PFAFFENREUTH",377137,4119,""]
[null,"LEONBERG","GROßENSEES",377137,4120,""]
[null,"LEOPOLDSREUTER WALD","BISCHOFSREUT",272455,5822,""]
[null,"LEUCHTENBERG","MICHLDORF",374132,4404,""]
[null,"LEUCHTENBERG","LEUCHTENBERG",374132,4405,""]
[null,"LEUCHTENBERG","LERAU",374132,4406,""]
[null,"LEUCHTENBERG","PREPPACH",374132,4407,""]
[null,"LEUCHTENBERG","DÖLLNITZ",374132,4408,""]
[null,"LEUPOLDSGRÜN","LEUPOLDSGRÜN",475145,1934,""]
[null,"LEUPOLDSGRÜN","LIPPERTS",475145,1935,""]
[null,"LEUTENBACH","LEUTENBACH",474147,2663,""]
[null,"LEUTENBACH","MITTELEHRENBACH",474147,2664,""]
[null,"LEUTENBACH","OBEREHRENBACH",474147,2665,""]
[null,"LEUTERSHAUSEN","AUERBACH",571174,3107,""]
[null,"LEUTERSHAUSEN","BRUNST",571174,3122,{"$f":"+IF(A4226<>\"\",1,\"\")","v":""}]
[null,"LEUTERSHAUSEN","BÜCHELBERG",571174,3123,""]
[null,"LEUTERSHAUSEN","ECKARTSWEILER",571174,3131,""]
[null,"LEUTERSHAUSEN","ERLACH",571174,3135,""]
[null,"LEUTERSHAUSEN","ERLBACH",571174,3136,""]
[null,"LEUTERSHAUSEN","FROMMETSFELDEN",571174,3141,""]
[null,"LEUTERSHAUSEN","JOCHSBERG",571174,3167,""]
[null,"LEUTERSHAUSEN","LEUTERSHAUSEN",571174,3180,""]
[null,"LEUTERSHAUSEN","MITTELRAMSTADT",571174,3187,""]
[null,"LEUTERSHAUSEN","NEUNKIRCHEN B.LEUTERSHAUSEN",571174,3194,""]
[null,"LEUTERSHAUSEN","RAUENBUCH",571174,3208,""]
[null,"LEUTERSHAUSEN","WIEDERSBACH",571174,3242,""]
[null,"LICHTENAU","FISCHBACH",571175,3138,""]
[null,"LICHTENAU","HERPERSDORF",571175,3158,""]
[null,"LICHTENAU","IMMELDORF",571175,3165,""]
[null,"LICHTENAU","LICHTENAU",571175,3181,""]
[null,"LICHTENAU","MALMERSDORF",571175,3183,""]
[null,"LICHTENAU","RATZENWINDEN",571175,3207,""]
[null,"LICHTENAU","SCHLAUERSBACH",571175,3217,""]
[null,"LICHTENAU","UNTERROTTMANNSDORF",571175,3228,""]
[null,"LICHTENAU","WATTENBACH",571175,3234,""]
[null,"LICHTENBERG","LICHTENBERG",475146,1860,""]
[null,"LICHTENFELS","BUCH A.FORST",478139,1322,""]
[null,"LICHTENFELS","BURGBERG",478139,1324,""]
[null,"LICHTENFELS","FORST BUCH A.FORST",478139,1348,""]
[null,"LICHTENFELS","ISLING",478139,1381,""]
[null,"LICHTENFELS","KÖSTEN",478139,1393,""]
[null,"LICHTENFELS","KÖTTEL",478139,1394,""]
[null,"LICHTENFELS","LAHM B.LICHTENFELS",478139,1396,""]
[null,"LICHTENFELS","LANGHEIM",478139,1398,""]
[null,"LICHTENFELS","LICHTENFELS",478139,1403,""]
[null,"LICHTENFELS","MISTELFELD",478139,1416,""]
[null,"LICHTENFELS","MÖNCHKRÖTTENDORF",478139,1419,""]
[null,"LICHTENFELS","OBERLANGHEIM",478139,1441,""]
[null,"LICHTENFELS","OBERWALLENSTADT",478139,1446,""]
[null,"LICHTENFELS","REUNDORF",478139,1454,""]
[null,"LICHTENFELS","ROTH",478139,1460,""]
[null,"LICHTENFELS","ROTHMANNSTHAL",478139,1464,""]
[null,"LICHTENFELS","SCHNEY",478139,1471,""]
[null,"LICHTENFELS","SEUBELSDORF",478139,1480,""]
[null,"LICHTENFELS","STETTEN",478139,1488,""]
[null,"LICHTENFELS","TRIEB",478139,1498,""]
[null,"LICHTENFELS","WEINGARTEN",478139,1518,""]
[null,"LINDACH","SCHÖNBRUNN I.STEIGERWALD",471457,2282,""]
[null,"LINDAU (BODENSEE)","UNTERREITNAU",776116,7935,""]
[null,"LINDAU (BODENSEE)","OBERREITNAU",776116,7936,""]
[null,"LINDAU (BODENSEE)","HOYREN",776116,7937,""]
[null,"LINDAU (BODENSEE)","AESCHACH",776116,7938,""]
[null,"LINDAU (BODENSEE)","REUTIN",776116,7939,""]
[null,"LINDAU (BODENSEE)","LINDAU (BODENSEE)",776116,7940,""]
[null,"LINDBERG","ZWIESLERWALDHAUS",276130,5717,""]
[null,"LINDBERG","LINDBERG",276130,5733,""]
[null,"LINDENBERG I.ALLGÄU","LINDENBERG I.ALLGÄU",776117,7952,""]
[null,"LINDENHARDTER FORST-NORDWEST","LINDENHARDTER FORST-NORDWEST",472460,2484,""]
[null,"LINDENHARDTER FORST-SÜDOST","GOTTSFELD",472461,2491,""]
[null,"LINDENHARDTER FORST-SÜDOST","LINDENHARDT",472461,2494,""]
[null,"LISBERG","LISBERG",471154,2215,""]
[null,"LISBERG","TRABELSDORF",471154,2307,""]
[null,"LITZENDORF","HAUPTSMOOR",471155,2184,""]
[null,"LITZENDORF","LITZENDORF",471155,2216,""]
[null,"LITZENDORF","LOHNDORF",471155,2217,""]
[null,"LITZENDORF","MELKENDORF",471155,2226,""]
[null,"LITZENDORF","NAISA",471155,2235,""]
[null,"LITZENDORF","PÖDELDORF",471155,2254,""]
[null,"LITZENDORF","SCHAMMELSDORF",471155,2278,{"$f":"+IF(A4290<>\"\",1,\"\")","v":""}]
[null,"LITZENDORF","TIEFENELLERN",471155,2304,""]
[null,"LOHBERG","LOHBERG",372178,5117,""]
[null,"LOHKIRCHEN","LOHKIRCHEN",183125,8816,""]
[null,"LÖHLITZER WALD","LÖHLITZER WALD",472462,2481,""]
[null,"LOHR A.MAIN","RUPPERTSHÜTTEN",677155,526,""]
[null,"LOHR A.MAIN","WOMBACH",677155,554,""]
[null,"LOHR A.MAIN","LOHR A.MAIN",677155,555,""]
[null,"LOHR A.MAIN","SACKENBACH",677155,556,""]
[null,"LOHR A.MAIN","SENDELBACH",677155,557,""]
[null,"LOHR A.MAIN","RODENBACH",677155,558,""]
[null,"LOHR A.MAIN","PFLOCHSBACH",677155,559,""]
[null,"LOHR A.MAIN","STEINBACH",677155,560,""]
[null,"LOHR A.MAIN","HALSBACH",677155,561,""]
[null,"LOICHING","LOICHING",279124,6192,""]
[null,"LOICHING","WEIGENDORF",279124,6195,""]
[null,"LOITZENDORF","LOITZENDORF",278147,5553,""]
[null,"LOITZENDORF","GITTENSDORF",278147,5554,""]
[null,"LONNERSTADT","FETZELHOFEN",572139,2777,""]
[null,"LONNERSTADT","LONNERSTADT",572139,2812,""]
[null,"LONNERSTADT","MAILACH",572139,2813,""]
[null,"LUDWIGSCHORGAST","LUDWIGSCHORGAST",477135,1763,""]
[null,"LUDWIGSSTADT","LAUENSTEIN",476152,1551,""]
[null,"LUDWIGSSTADT","STEINBACH A.D.HAIDE",476152,1552,""]
[null,"LUDWIGSSTADT","EBERSDORF",476152,1553,""]
[null,"LUDWIGSSTADT","LUDWIGSSTADT",476152,1554,""]
[null,"LUDWIGSSTADT","OTTENDORF",476152,1555,""]
[null,"LUDWIGSSTADT","LAUENHAIN",476152,1556,""]
[null,"LUHE-WILDENAU","ROTHENSTADT",374133,4359,""]
[null,"LUHE-WILDENAU","ETZENRICHT",374133,4389,""]
[null,"LUHE-WILDENAU","OBERWILDENAU",374133,4393,""]
[null,"LUHE-WILDENAU","UNTERWILDENAU",374133,4394,""]
[null,"LUHE-WILDENAU","NEUDORF B.LUHE",374133,4396,""]
[null,"LUHE-WILDENAU","LUHE",374133,4397,""]
[null,"LÜLSFELD","LÜLSFELD",678153,1055,""]
[null,"LÜLSFELD","SCHALLFELD",678153,1056,""]
[null,"LUPBURG","PARSBERG",373143,5411,""]
[null,"LUPBURG","DEGERNDORF",373143,5414,""]
[null,"LUPBURG","LUPBURG",373143,5415,""]
[null,"LUPBURG","SEE",373143,5416,""]
[null,"LUßBERGER FORST","LUßBERGER FORST",471458,2221,""]
[null,"LUTZINGEN","UNTERLIEZHEIM",773146,6819,""]
[null,"LUTZINGEN","LUTZINGEN",773146,6820,""]
[null,"MÄHRING","GROßKONREUTH",377139,4152,""]
[null,"MÄHRING","MÄHRING",377139,4153,""]
[null,"MÄHRING","DIPPERSREUTH",377139,4154,""]
[null,"MÄHRING","GRIESBACH",377139,4155,""]
[null,"MAIERHÖFEN","MAIERHÖFEN",776118,7955,""]
[null,"MAIHINGEN","UTZWINGEN",779176,6727,""]
[null,"MAIHINGEN","MAIHINGEN",779176,6728,""]
[null,"MAINASCHAFF","MAINASCHAFF",671140,366,""]
[null,"MAINBERNHEIM","MAINBERNHEIM",675144,1184,""]
[null,"MAINBURG","EBRANTSHAUSEN",273147,6018,""]
[null,"MAINBURG","HOLZMANNSHAUSEN",273147,6038,""]
[null,"MAINBURG","LINDKIRCHEN",273147,6050,""]
[null,"MAINBURG","MAINBURG",273147,6052,""]
[null,"MAINBURG","MEILENHAUSEN",273147,6056,""]
[null,"MAINBURG","MEILENHOFEN",273147,6057,""]
[null,"MAINBURG","OBEREMPFENBACH",273147,6066,""]
[null,"MAINBURG","SANDELZHAUSEN",273147,6088,""]
[null,"MAINBURG","STEINBACH",273147,6096,""]
[null,"MAINECKER FORST","MAINECKER FORST",478452,1822,""]
[null,"MAINLEUS","SCHIMMENDORF",477136,1731,""]
[null,"MAINLEUS","DANNDORF",477136,1732,""]
[null,"MAINLEUS","SCHMEILSDORF",477136,1733,{"$f":"+IF(A4354<>\"\",1,\"\")","v":""}]
[null,"MAINLEUS","VEITLAHM",477136,1734,""]
[null,"MAINLEUS","SCHWARZACH B.KULMBACH",477136,1735,""]
[null,"MAINLEUS","WERNSTEIN",477136,1736,""]
[null,"MAINLEUS","MOTSCHENBACH",477136,1737,""]
[null,"MAINLEUS","WILLMERSREUTH",477136,1738,""]
[null,"MAINLEUS","MAINLEUS",477136,1739,""]
[null,"MAINLEUS","DÖRFLES",477136,1740,""]
[null,"MAINLEUS","BUCHAU",477136,1741,""]
[null,"MAINLEUS","WÜSTENDORF",477136,1742,""]
[null,"MAINLEUS","PROß",477136,1743,""]
[null,"MAINLEUS","KATSCHENREUTH",477136,1758,""]
[null,"MAINLEUS","LOPP",477136,1781,""]
[null,"MAINLEUS","MAINECKER FORST",477136,1822,""]
[null,"MAINLEUS","MAINECKER FORST - MAINLEUS",477136,1835,""]
[null,"MAINLEUS","MAINECKER FORST (OST)",477136,1837,""]
[null,"MAINSTOCKHEIM","MAINSTOCKHEIM",675146,1149,""]
[null,"MAISACH","MAISACH",179134,8456,""]
[null,"MAISACH","GERMERSWANG",179134,8457,""]
[null,"MAISACH","MALCHING",179134,8458,""]
[null,"MAISACH","ROTTBACH",179134,8459,""]
[null,"MAISACH","ÜBERACKER",179134,8460,""]
[null,"MAITENBETH","MAITENBETH",183126,9701,""]
[null,"MAITENBETH","GROßHAAGER FORST",183126,9702,""]
[null,"MAITENBETH","INNACH",183126,9703,""]
[null,"MALCHING","MALCHING",275132,6528,""]
[null,"MALGERSDORF","MALGERSDORF",277131,6436,""]
[null,"MALLERSDORF-PFAFFENB","UPFKOFEN",278148,5630,""]
[null,"MALLERSDORF-PFAFFENB","HOLZTRAUBACH",278148,5647,""]
[null,"MALLERSDORF-PFAFFENB","GRAFENTRAUBACH",278148,5648,""]
[null,"MALLERSDORF-PFAFFENB","OBERHASELBACH",278148,5659,""]
[null,"MALLERSDORF-PFAFFENB","PFAFFENBERG",278148,5660,""]
[null,"MALLERSDORF-PFAFFENB","MALLERSDORF",278148,5661,""]
[null,"MALLERSDORF-PFAFFENB","OBERLINDHART",278148,5670,""]
[null,"MALLERSDORF-PFAFFENB","OBERELLENBACH",278148,5671,""]
[null,"MAMMENDORF","MAMMENDORF",179136,8473,""]
[null,"MAMMENDORF","NANNHOFEN",179136,8474,""]
[null,"MAMMING","BUBACH",279125,6177,""]
[null,"MAMMING","MAMMING",279125,6180,""]
[null,"MANCHING","WESTENHAUSEN",186137,8063,""]
[null,"MANCHING","OBERSTIMM",186137,8064,""]
[null,"MANCHING","NIEDERSTIMM",186137,8065,""]
[null,"MANCHING","PICHL",186137,8066,""]
[null,"MANCHING","MANCHING",186137,8067,""]
[null,"MANTEL","MANTELER FORST",374134,4352,""]
[null,"MANTEL","STEINFELS",374134,4384,""]
[null,"MANTEL","RUPPRECHTSREUTH",374134,4385,""]
[null,"MANTEL","MANTEL",374134,4386,""]
[null,"MANTELER FORST","SCHWARZENBACH",374452,4351,""]
[null,"MANTELER FORST","MANTELER FORST",374452,4352,""]
[null,"MARGETSHÖCHHEIM","MARGETSHÖCHHEIM",679161,684,""]
[null,"MARIAPOSCHING","MARIAPOSCHING",278149,5644,""]
[null,"MARK","MARK",572459,2814,""]
[null,"MARKERTSGRÜNER FORST-OST","MARKERTSGRÜNER FORST-OST",674453,1044,""]
[null,"MARKERTSGRÜNER FORST-WEST","MARKERTSGRÜNER FORST-WEST",674454,1028,""]
[null,"MARKLKOFEN","FRAUENBIBURG",279126,6152,""]
[null,"MARKLKOFEN","MARKLKOFEN",279126,6166,""]
[null,"MARKLKOFEN","POXAU",279126,6167,""]
[null,"MARKLKOFEN","REITH",279126,6169,""]
[null,"MARKLKOFEN","STEINBERG",279126,6170,""]
[null,"MARKT BEROLZHEIM","MARKT BEROLZHEIM",577149,3638,""]
[null,"MARKT BIBART","ZIEGENBACH",575144,1209,""]
[null,"MARKT BIBART","ALTMANNSHAUSEN",575144,1223,""]
[null,"MARKT BIBART","MARKT BIBART",575144,1243,""]
[null,"MARKT EINERSHEIM","MARKT EINERSHEIM",675148,1207,{"$f":"+IF(A4418<>\"\",1,\"\")","v":""}]
[null,"MARKT ERLBACH","MARKT ERLBACH",575145,3305,""]
[null,"MARKT ERLBACH","KLAUSAURACH",575145,3306,""]
[null,"MARKT ERLBACH","BUCHEN",575145,3307,""]
[null,"MARKT ERLBACH","LOSAURACH",575145,3308,""]
[null,"MARKT ERLBACH","KOTZENAURACH",575145,3309,""]
[null,"MARKT ERLBACH","SIEDELBACH",575145,3310,""]
[null,"MARKT ERLBACH","JOBSTGREUTH",575145,3311,""]
[null,"MARKT ERLBACH","LINDEN",575145,3312,""]
[null,"MARKT ERLBACH","ALTSELINGSBACH",575145,3313,""]
[null,"MARKT ERLBACH","ESCHENBACH",575145,3314,""]
[null,"MARKT INDERSDORF","WEICHS",174131,8552,""]
[null,"MARKT INDERSDORF","WESTERHOLZHAUSEN",174131,8554,""]
[null,"MARKT INDERSDORF","AINHOFEN",174131,8601,""]
[null,"MARKT INDERSDORF","EICHHOFEN",174131,8609,""]
[null,"MARKT INDERSDORF","FRAUENHOFEN",174131,8615,""]
[null,"MARKT INDERSDORF","GLONN",174131,8617,""]
[null,"MARKT INDERSDORF","HIRTLBACH",174131,8623,""]
[null,"MARKT INDERSDORF","LANGENPETTENBACH",174131,8627,""]
[null,"MARKT INDERSDORF","MARKT INDERSDORF",174131,8629,""]
[null,"MARKT INDERSDORF","NIEDERROTH",174131,8630,""]
[null,"MARKT INDERSDORF","PIPINSRIED",174131,8638,""]
[null,"MARKT INDERSDORF","RIED",174131,8641,""]
[null,"MARKT NORDHEIM","HERBOLZHEIM",575146,2971,""]
[null,"MARKT NORDHEIM","MARKT NORDHEIM",575146,2995,""]
[null,"MARKT NORDHEIM","ULSENHEIM",575146,3046,""]
[null,"MARKT RETTENBACH","FRECHENRIEDEN",778168,7589,""]
[null,"MARKT RETTENBACH","GOTTENAU",778168,7590,""]
[null,"MARKT RETTENBACH","MUSSENHAUSEN",778168,7591,""]
[null,"MARKT RETTENBACH","MARKT RETTENBACH",778168,7592,""]
[null,"MARKT RETTENBACH","LANNENBERG",778168,7593,""]
[null,"MARKT RETTENBACH","EUTENHAUSEN",778168,7594,""]
[null,"MARKT RETTENBACH","ENGETRIED",778168,7595,""]
[null,"MARKT RETTENBACH","WINEDEN",778168,7596,""]
[null,"MARKT RETTENBACH","HOLZERWALD",778168,7597,""]
[null,"MARKT SCHWABEN","MARKT SCHWABEN",175127,8777,""]
[null,"MARKT TASCHENDORF","MARKT TASCHENDORF",575147,1198,""]
[null,"MARKT TASCHENDORF","FRANKFURT",575147,1215,""]
[null,"MARKT TASCHENDORF","HOMBEER",575147,1216,""]
[null,"MARKT TASCHENDORF","OBERSTEINBACH",575147,1229,""]
[null,"MARKT WALD","IMMELSTETTEN",778169,7765,""]
[null,"MARKT WALD","OBERNEUFNACH",778169,7766,""]
[null,"MARKT WALD","ANHOFEN",778169,7767,""]
[null,"MARKT WALD","MARKT WALD",778169,7768,""]
[null,"MARKTBERGEL","ERMETZHOF",575143,2941,""]
[null,"MARKTBERGEL","MARKTBERGEL",575143,2994,""]
[null,"MARKTBERGEL","OTTENHOFEN",575143,3018,""]
[null,"MARKTBREIT","MARKTBREIT",675147,1217,""]
[null,"MARKTBREIT","GNODSTADT",675147,1230,""]
[null,"MARKTGRAITZ","MARKTGRAITZ",478143,1407,""]
[null,"MARKTHEIDENFELD","ZIMMERN",677157,583,""]
[null,"MARKTHEIDENFELD","MARIENBRUNN",677157,592,""]
[null,"MARKTHEIDENFELD","MICHELRIETH",677157,598,""]
[null,"MARKTHEIDENFELD","ALTFELD",677157,599,""]
[null,"MARKTHEIDENFELD","MARKTHEIDENFELD",677157,600,""]
[null,"MARKTHEIDENFELD","GLASOFEN",677157,601,""]
[null,"MARKTHEIDENFELD","OBERWITTBACH",677157,605,""]
[null,"MARKTL","MARKTL",171123,8919,""]
[null,"MARKTL","Marktlberg",171123,8920,""]
[null,"MARKTL","SCHÜTZING",171123,8934,""]
[null,"MARKTL","DAXENTHALER FORST",171123,8948,""]
[null,"MARKTLEUGAST","NEUENSORG",477138,1726,""]
[null,"MARKTLEUGAST","HOHENBERG",477138,1727,""]
[null,"MARKTLEUGAST","MARKTLEUGAST",477138,1728,""]
[null,"MARKTLEUGAST","TRAINDORF",477138,1729,{"$f":"+IF(A4482<>\"\",1,\"\")","v":""}]
[null,"MARKTLEUGAST","MARIENWEIHER",477138,1730,""]
[null,"MARKTLEUTHEN","REICHOLDSGRÜN",479135,2023,""]
[null,"MARKTLEUTHEN","KAISERHAMMER FORST-WEST",479135,2026,""]
[null,"MARKTLEUTHEN","GROßWENDERN",479135,2031,""]
[null,"MARKTLEUTHEN","MARKTLEUTHEN",479135,2032,""]
[null,"MARKTLEUTHEN","SCHWARZENHAMMER",479135,2033,""]
[null,"MARKTLEUTHEN","NEUDES",479135,2034,""]
[null,"MARKTOBERDORF","MARKTOBERDORF",777151,7883,""]
[null,"MARKTOBERDORF","BERTOLDSHOFEN",777151,7884,""]
[null,"MARKTOBERDORF","GEISENRIED",777151,7885,""]
[null,"MARKTOBERDORF","THALHOFEN A.D.WERTACH",777151,7886,""]
[null,"MARKTOBERDORF","LEUTERSCHACH",777151,7887,""]
[null,"MARKTOBERDORF","RIEDER",777151,7888,""]
[null,"MARKTOBERDORF","SULZSCHNEID",777151,7889,""]
[null,"MARKTOFFINGEN","MINDEROFFINGEN",779177,6725,""]
[null,"MARKTOFFINGEN","MARKTOFFINGEN",779177,6726,""]
[null,"MARKTREDWITZ","LEUTENDORF",479136,2066,""]
[null,"MARKTREDWITZ","HAID",479136,2078,""]
[null,"MARKTREDWITZ","THÖLAU",479136,2079,""]
[null,"MARKTREDWITZ","LORENZREUTH",479136,2080,""]
[null,"MARKTREDWITZ","BRAND",479136,2081,""]
[null,"MARKTREDWITZ","OBERREDWITZ",479136,2082,""]
[null,"MARKTREDWITZ","MARKTREDWITZ",479136,2083,""]
[null,"MARKTREDWITZ","WÖLSAU",479136,2084,""]
[null,"MARKTREDWITZ","WÖLSAUERHAMMER",479136,2085,""]
[null,"MARKTREDWITZ","HAINGRÜN",479136,2087,""]
[null,"MARKTREDWITZ","DÖRFLAS",479136,2088,""]
[null,"MARKTREDWITZ","KORBERSDORF",479136,2096,""]
[null,"MARKTRODACH","ZEYERN",476183,1625,""]
[null,"MARKTRODACH","OBERRODACH",476183,1626,""]
[null,"MARKTRODACH","UNTERRODACH",476183,1627,""]
[null,"MARKTRODACH","GROßVICHTACH",476183,1628,""]
[null,"MARKTRODACH","SEIBELSDORF",476183,1629,""]
[null,"MARKTSCHELLENBERG","BISCHOFSWIESENER FORST",172124,9954,""]
[null,"MARKTSCHELLENBERG","MARKTSCHELLENBERG",172124,9958,""]
[null,"MARKTSCHELLENBERG","LANDSCHELLENBERG",172124,9959,""]
[null,"MARKTSCHELLENBERG","ETTENBERG",172124,9960,""]
[null,"MARKTSCHELLENBERG","SCHEFFAU",172124,9961,""]
[null,"MARKTSCHORGAST","ZIEGENBURG",477139,1774,""]
[null,"MARKTSCHORGAST","MARKTSCHORGAST",477139,1775,""]
[null,"MARKTSCHORGAST","PULST",477139,1776,""]
[null,"MARKTSTEFT","MARKTSTEFT",675149,1204,""]
[null,"MARKTSTEFT","MICHELFELD",675149,1205,""]
[null,"MARKTZEULN","MARKTZEULN",478144,1408,""]
[null,"MARKTZEULN","ZETTLITZ",478144,1536,""]
[null,"MARLOFFSTEIN","ADLITZ",572141,2752,""]
[null,"MARLOFFSTEIN","ATZELSBERG",572141,2754,""]
[null,"MARLOFFSTEIN","MARLOFFSTEIN",572141,2815,""]
[null,"MAROLDSWEISACH","ALLERTSHAUSEN",674171,2102,""]
[null,"MAROLDSWEISACH","ALTENSTEIN",674171,2104,""]
[null,"MAROLDSWEISACH","BIRKENFELD",674171,2113,""]
[null,"MAROLDSWEISACH","DIPPACH",674171,2137,""]
[null,"MAROLDSWEISACH","DITTERSWIND",674171,2138,""]
[null,"MAROLDSWEISACH","DÜRRENRIED",674171,2144,""]
[null,"MAROLDSWEISACH","ECKARTSHAUSEN",674171,2148,""]
[null,"MAROLDSWEISACH","GÜCKELHIRN",674171,2174,""]
[null,"MAROLDSWEISACH","HAFENPREPPACH",674171,2177,""]
[null,"MAROLDSWEISACH","LINDACH B.MAROLDSWEISACH",674171,2214,""]
[null,"MAROLDSWEISACH","MARBACH",674171,2222,""]
[null,"MAROLDSWEISACH","MAROLDSWEISACH",674171,2223,""]
[null,"MAROLDSWEISACH","PFAFFENDORF",674171,2252,""]
[null,"MAROLDSWEISACH","VOCCAWIND",674171,2325,""]
[null,"MAROLDSWEISACH","WASMUTHHAUSEN",674171,2330,""]
[null,"MARQUARTSTEIN","MARQUARTSTEIN",189129,9858,{"$f":"+IF(A4546<>\"\",1,\"\")","v":""}]
[null,"MARTINLAMITZER FORST-NORD","MARTINLAMITZER FORST-NORD",475454,1966,""]
[null,"MARTINLAMITZER FORST-SÜD","MARTINLAMITZER FORST-SÜD",479455,2024,""]
[null,"MARTINSHEIM","ENHEIM",675150,1231,""]
[null,"MARTINSHEIM","MARTINSHEIM",675150,1232,""]
[null,"MARTINSHEIM","UNTERICKELSHEIM",675150,1233,""]
[null,"MARTINSHEIM","GNÖTZHEIM",675150,1234,""]
[null,"MARXHEIM","BLOSSENAU",779178,6918,""]
[null,"MARXHEIM","BURGMANNSHOFEN",779178,6940,""]
[null,"MARXHEIM","GANSHEIM",779178,6941,""]
[null,"MARXHEIM","GRAISBACH",779178,6942,""]
[null,"MARXHEIM","SCHWEINSPOINT",779178,6943,""]
[null,"MARXHEIM","NEUHAUSEN",779178,6944,""]
[null,"MARXHEIM","MARXHEIM",779178,6945,""]
[null,"MARZLING","MARZLING",178140,8313,""]
[null,"MARZLING","RUDLFING",178140,8314,""]
[null,"MAßBACH","POPPENLAUER",672131,240,""]
[null,"MAßBACH","WEICHTUNGEN",672131,241,""]
[null,"MAßBACH","MAßBERG",672131,272,""]
[null,"MAßBACH","MAßBACH",672131,273,""]
[null,"MAßBACH","VOLKERSHAUSEN",672131,275,""]
[null,"MASSING","MALLING",277133,6437,""]
[null,"MASSING","MASSING",277133,6440,""]
[null,"MASSING","STAUDACH",277133,6467,""]
[null,"MASSING","WOLFSEGG",277133,6480,""]
[null,"MAUERN","MARGARETHENRIED",178142,8269,""]
[null,"MAUERN","ENGHAUSEN",178142,8272,""]
[null,"MAUERN","REICHERSDORF",178142,8273,""]
[null,"MAUERN","MAUERN",178142,8274,""]
[null,"MAUERN","SCHWEINERSDORF",178142,8275,""]
[null,"MAUERSTETTEN","MAUERSTETTEN",777152,7850,""]
[null,"MAUERSTETTEN","FRANKENRIED",777152,7851,""]
[null,"MAUTH","SCHÖNBRUNN A.LUSEN",272134,5808,""]
[null,"MAUTH","MAUTH",272134,5809,""]
[null,"MAUTH","ANNATHAL",272134,5810,""]
[null,"MAUTHER FORST","MAUTHER FORST",272456,5807,""]
[null,"MAXHÜTTE-HAIDHOF","MAXHÜTTE-HAIDHOF",376141,4784,""]
[null,"MAXHÜTTE-HAIDHOF","LEONBERG",376141,4786,""]
[null,"MAXHÜTTE-HAIDHOF","PIRKENSEE",376141,4787,""]
[null,"MAXHÜTTE-HAIDHOF","PONHOLZ",376141,4788,""]
[null,"MAXHÜTTE-HAIDHOF","PONHOLZER FORST",376141,4789,""]
[null,"MEDLINGEN","UNTERMEDLINGEN",773153,6850,""]
[null,"MEDLINGEN","OBERMEDLINGEN",773153,6851,""]
[null,"MEEDER","AHLSTADT",473144,1301,""]
[null,"MEEDER","BEUERFELD",473144,1309,""]
[null,"MEEDER","DROSSENHAUSEN",473144,1337,""]
[null,"MEEDER","GROßWALBUR",473144,1364,""]
[null,"MEEDER","HERBARTSDORF",473144,1374,""]
[null,"MEEDER","KIRCHBERG",473144,1387,""]
[null,"MEEDER","KLEINWALBUR",473144,1389,""]
[null,"MEEDER","KÖSFELD",473144,1392,""]
[null,"MEEDER","MEEDER",473144,1410,""]
[null,"MEEDER","MIRSDORF",473144,1415,""]
[null,"MEEDER","MOGGENBRUNN",473144,1422,""]
[null,"MEEDER","NEIDA",473144,1424,""]
[null,"MEEDER","OTTOWIND",473144,1450,""]
[null,"MEEDER","SULZDORF",473144,1492,""]
[null,"MEEDER","WIESENFELD B.COBURG",473144,1526,""]
[null,"MEGESHEIM","MEGESHEIM",779180,6721,""]
[null,"MEHLMEISEL","FICHTELBERG",472164,2388,""]
[null,"MEHLMEISEL","NEUGRÜN",472164,2389,""]
[null,"MEHLMEISEL","MEHLMEISEL",472164,2390,""]
[null,"MEHRING","MEHRING",171124,8921,""]
[null,"MEHRING","HOLZFELDER FORST",171124,8949,""]
[null,"MEIERHÖFER SEITE","MEIERHÖFER SEITE",479456,2057,{"$f":"+IF(A4610<>\"\",1,\"\")","v":""}]
[null,"MEINHEIM","KURZENALTHEIM",577150,3633,""]
[null,"MEINHEIM","MEINHEIM",577150,3634,""]
[null,"MEITINGEN","OSTENDORF",772177,6996,""]
[null,"MEITINGEN","LANGENREICHEN",772177,6997,""]
[null,"MEITINGEN","MEITINGEN",772177,6998,""]
[null,"MEITINGEN","ERLINGEN",772177,6999,""]
[null,"MEITINGEN","HERBERTSHOFEN",772177,7000,""]
[null,"MELLRICHSTADT","EUßENHAUSEN",673142,27,""]
[null,"MELLRICHSTADT","MELLRICHSTADT",673142,36,""]
[null,"MELLRICHSTADT","MÜHLFELD",673142,37,""]
[null,"MELLRICHSTADT","ROßRIETH",673142,38,""]
[null,"MELLRICHSTADT","FRICKENHAUSEN",673142,45,""]
[null,"MELLRICHSTADT","SONDHEIM",673142,47,""]
[null,"MELLRICHSTADT","BAHRA",673142,54,""]
[null,"MELLRICHSTADT","MELLRICHSTADT, BERGWERKE",673142,128,""]
[null,"MELLRICHSTADTER FORST","MELLRICHSTADTER FORST",673455,9,""]
[null,"MEMMELSDORF","DROSENDORF",471159,2143,""]
[null,"MEMMELSDORF","KREMMELDORF",471159,2207,""]
[null,"MEMMELSDORF","MEEDENSDORF",471159,2225,""]
[null,"MEMMELSDORF","MEMMELSDORF",471159,2227,""]
[null,"MEMMELSDORF","MERKENDORF",471159,2229,""]
[null,"MEMMELSDORF","WEICHENDORF",471159,2332,""]
[null,"MEMMINGEN","BUXHEIM",764000,7565,""]
[null,"MEMMINGEN","STEINHEIM",764000,7566,""]
[null,"MEMMINGEN","AMENDINGEN",764000,7567,""]
[null,"MEMMINGEN","EISENBURG",764000,7568,""]
[null,"MEMMINGEN","BUXACH",764000,7569,""]
[null,"MEMMINGEN","MEMMINGEN",764000,7570,""]
[null,"MEMMINGEN","FERTHOFEN",764000,7571,""]
[null,"MEMMINGEN","VOLKRATSHOFEN",764000,7572,""]
[null,"MEMMINGEN","DICKENREISHAUSEN",764000,7573,""]
[null,"MEMMINGERBERG","MEMMINGERBERG",778171,7577,""]
[null,"MENGKOFEN","HOFDORF",279127,6181,""]
[null,"MENGKOFEN","HÜTTENKOFEN",279127,6182,""]
[null,"MENGKOFEN","MARTINSBUCH",279127,6183,""]
[null,"MENGKOFEN","MÜHLHAUSEN",279127,6184,""]
[null,"MENGKOFEN","TUNZENBERG",279127,6185,""]
[null,"MERCHING","MERCHING",771145,7391,""]
[null,"MERCHING","BRUNNEN",771145,7392,""]
[null,"MERCHING","STEINACH B.MERING",771145,7393,""]
[null,"MERCHING","HOCHDORF",771145,7394,""]
[null,"MERING","MERING",771146,7389,""]
[null,"MERING","BAIERBERG",771146,7390,""]
[null,"MERKENDORF","GERBERSDORF",571177,3143,""]
[null,"MERKENDORF","GROßBREITENBRONN",571177,3147,""]
[null,"MERKENDORF","HEGLAU",571177,3153,""]
[null,"MERKENDORF","HIRSCHLACH",571177,3162,""]
[null,"MERKENDORF","MERKENDORF",571177,3184,""]
[null,"MERTINGEN","MERTINGEN",779181,6981,""]
[null,"MERTINGEN","DRUISHEIM",779181,6982,""]
[null,"MESPELBRUNN","WALDASCHAFFER FORST",671141,373,""]
[null,"MESPELBRUNN","HESSENTHAL",671141,384,""]
[null,"MESPELBRUNN","MESPELBRUNN",671141,387,""]
[null,"METTEN","METTEN",271132,5911,""]
[null,"METTENHEIM","GUMATTENKIRCHEN",183127,8833,""]
[null,"METTENHEIM","METTENHEIM",183127,8834,""]
[null,"METTENHEIM","LOCHHEIM",183127,8835,""]
[null,"MICHELAU I.OFR.","LETTENREUTH",478145,1402,""]
[null,"MICHELAU I.OFR.","MICHELAU I.OFR.",478145,1414,""]
[null,"MICHELAU I.OFR.","NEUENSEE",478145,1425,""]
[null,"MICHELAU I.OFR.","SCHWÜRBITZ",478145,1477,""]
[null,"MICHELAU I.STEIGERWA","HUNDELSHAUSEN",678157,1022,""]
[null,"MICHELAU I.STEIGERWA","ALTMANNSDORF",678157,1023,""]
[null,"MICHELAU I.STEIGERWA","MICHELAU I.STEIGERWALD",678157,1039,{"$f":"+IF(A4674<>\"\",1,\"\")","v":""}]
[null,"MICHELAU I.STEIGERWA","PRÜßBERG",678157,1040,""]
[null,"MICHELRIETHER FORST","KREDENBACH",677460,591,""]
[null,"MICHELRIETHER FORST","MICHELRIETH",677460,598,""]
[null,"MICHELSNEUKIRCHEN","MICHELSNEUKIRCHEN",372142,5140,""]
[null,"MICHLBACH","VOHENSTRAUß",374453,4365,""]
[null,"MICHLBACH","BURGTRESWITZ",374453,4367,""]
[null,"MICKHAUSEN","MICKHAUSEN",772178,7313,""]
[null,"MICKHAUSEN","MÜNSTER",772178,7314,""]
[null,"MICKHAUSEN","GRIMOLDSRIED",772178,7315,""]
[null,"MICKHAUSEN","REINHARTSHOFEN",772178,7321,""]
[null,"MIESBACH","WIES",182125,9513,""]
[null,"MIESBACH","MIESBACH",182125,9514,""]
[null,"MIESBACH","PARSBERG",182125,9515,""]
[null,"MIESBACH","NIKLASREUTH",182125,9516,""]
[null,"MIESBACH","HAUSHAM",182125,9517,""]
[null,"MIESBACH","WÖRNSMÜHL",182125,9518,""]
[null,"MILTACH","MILTACH",372143,5158,""]
[null,"MILTACH","OBERNDORF",372143,5159,""]
[null,"MILTACH","EISMANNSBERG",372143,5160,""]
[null,"MILTACH","ALTRANDSBERG",372143,5161,""]
[null,"MILTACH","KREUZBACH",372143,5163,""]
[null,"MILTACH","ALLMANNSDORF",372143,5164,""]
[null,"MILTENBERG","MAINBULLAU",676139,454,""]
[null,"MILTENBERG","BREITENDIEL",676139,455,""]
[null,"MILTENBERG","MILTENBERG",676139,456,""]
[null,"MILTENBERG","WENSCHDORF",676139,464,""]
[null,"MILTENBERG","SCHIPPACH/MIL",676139,465,""]
[null,"MINDELHEIM","WESTERNACH",778173,7777,""]
[null,"MINDELHEIM","NASSENBEUREN",778173,7778,""]
[null,"MINDELHEIM","UNTERAUERBACH",778173,7779,""]
[null,"MINDELHEIM","OBERAUERBACH",778173,7780,""]
[null,"MINDELHEIM","MINDELHEIM",778173,7781,""]
[null,"MINDELHEIM","GERNSTALL",778173,7782,""]
[null,"MINDELHEIM","HEIMENEGG",778173,7783,""]
[null,"MINDELHEIM","MINDELAU",778173,7784,""]
[null,"MINDELSTETTEN","TETTENAGGER",176147,8032,""]
[null,"MINDELSTETTEN","OBEROFFENDORF",176147,8033,""]
[null,"MINDELSTETTEN","MINDELSTETTEN",176147,8034,""]
[null,"MINDELSTETTEN","HÜTTENHAUSEN",176147,8035,""]
[null,"MINDELSTETTEN","IMBATH",176147,8036,""]
[null,"MINDELSTETTEN","HIENDORF",176147,8037,""]
[null,"MINTRACHING","KÖFERING",375170,5273,""]
[null,"MINTRACHING","MANGOLDING",375170,5283,""]
[null,"MINTRACHING","MINTRACHING",375170,5285,""]
[null,"MINTRACHING","MOOSHAM",375170,5287,""]
[null,"MINTRACHING","ROSENHOF",375170,5319,""]
[null,"MINTRACHING","SENGKOFEN",375170,5330,""]
[null,"MINTRACHING","TIEFBRUNN",375170,5340,""]
[null,"MINTRACHING","SCHEUER",375170,5361,""]
[null,"MISSEN-WILHAMS","WILHAMS",780127,7967,""]
[null,"MISSEN-WILHAMS","MISSEN",780127,7968,""]
[null,"MISTELBACH","MISTELBACH",472166,2462,""]
[null,"MISTELGAU","OBERNSEES",472167,2408,""]
[null,"MISTELGAU","SEITENBACH",472167,2409,""]
[null,"MISTELGAU","TRUPPACH",472167,2410,""]
[null,"MISTELGAU","MENGERSDORF",472167,2411,""]
[null,"MISTELGAU","FRANKENHAAG",472167,2412,""]
[null,"MISTELGAU","MISTELGAU",472167,2413,""]
[null,"MISTELGAU","WOHNSGEHAIG",472167,2414,""]
[null,"MISTELGAU","PLÖSEN",472167,2415,""]
[null,"MISTELGAU","CREEZ",472167,2467,""]
[null,"MITTELESCHENBACH","MITTELESCHENBACH",571178,3186,""]
[null,"MITTELNEUFNACH","MITTELNEUFNACH",772179,7316,""]
[null,"MITTELNEUFNACH","REICHERTSHOFEN",772179,7317,{"$f":"+IF(A4738<>\"\",1,\"\")","v":""}]
[null,"MITTELSINN","FORST AURA",677159,503,""]
[null,"MITTELSINN","MITTELSINN",677159,504,""]
[null,"MITTELSTETTEN","MITTELSTETTEN",179137,8465,""]
[null,"MITTELSTETTEN","OBERDORF",179137,8466,""]
[null,"MITTELSTETTEN","TEGERNBACH",179137,8467,""]
[null,"MITTENWALD","MITTENWALD",180123,9261,""]
[null,"MITTERBERG","DIMPFL",374454,4341,""]
[null,"MITTERBERG","REINHARDSRIETH",374454,4343,""]
[null,"MITTERBERG","MIESBRUNN",374454,4344,""]
[null,"MITTERFELS","MITTERFELS",278151,5589,""]
[null,"MITTERSKIRCHEN","HAMMERSBACH",277134,6419,""]
[null,"MITTERSKIRCHEN","HIRSCHHORN",277134,6423,""]
[null,"MITTERSKIRCHEN","MITTERSKIRCHEN",277134,6442,""]
[null,"MITTERTEICH","PLEUßEN",377141,4114,""]
[null,"MITTERTEICH","PECHBRUNN",377141,4116,""]
[null,"MITTERTEICH","MITTERTEICH",377141,4117,""]
[null,"MITTERTEICH","GROßENSTERZ",377141,4121,""]
[null,"MITTERTEICH","WIESAU",377141,4126,""]
[null,"MITWITZ","SCHWÄRZDORF",476154,1630,""]
[null,"MITWITZ","NEUNDORF",476154,1631,""]
[null,"MITWITZ","STEINACH A.D.STEINACH",476154,1632,""]
[null,"MITWITZ","MITWITZ",476154,1633,""]
[null,"MITWITZ","KALTENBRUNN",476154,1634,""]
[null,"MITWITZ","BURGSTALL",476154,1635,""]
[null,"MITWITZ","HOF A.D.STEINACH",476154,1636,""]
[null,"MITWITZ","HORB A.D.STEINACH",476154,1637,""]
[null,"MITWITZ","LEUTENDORF",476154,1638,""]
[null,"MÖDINGEN","MÖDINGEN",773147,6844,""]
[null,"MÖDINGEN","BERGHEIM",773147,6845,""]
[null,"MÖHRENDORF","KLEINSEEBACH",572142,2806,""]
[null,"MÖHRENDORF","MÖHRENDORF",572142,2816,""]
[null,"MÖMBRIS","DÖRNSTEINBACH",671143,309,""]
[null,"MÖMBRIS","HEMSBACH",671143,323,""]
[null,"MÖMBRIS","NIEDERSTEINBACH",671143,324,""]
[null,"MÖMBRIS","MÖMBRIS",671143,325,""]
[null,"MÖMBRIS","MENSENGESÄß",671143,326,""]
[null,"MÖMBRIS","HOHL",671143,334,""]
[null,"MÖMBRIS","SCHIMBORN",671143,335,""]
[null,"MÖMBRIS","KÖNIGSHOFEN A.D.KAHL",671143,336,""]
[null,"MÖMBRIS","REICHENBACH",671143,344,""]
[null,"MÖMBRIS","DAXBERG",671143,348,""]
[null,"MÖMLINGEN","MÖMLINGEN",676140,413,""]
[null,"MÖNCHBERG","SCHMACHTENBERG",676141,435,""]
[null,"MÖNCHBERG","MÖNCHBERG",676141,436,""]
[null,"MÖNCHSDEGGINGEN","MERZINGEN",779184,6767,""]
[null,"MÖNCHSDEGGINGEN","MÖNCHSDEGGINGEN",779184,6768,""]
[null,"MÖNCHSDEGGINGEN","ZISWINGEN",779184,6769,""]
[null,"MÖNCHSDEGGINGEN","UNTERMAGERBEIN",779184,6770,""]
[null,"MÖNCHSDEGGINGEN","SCHAFFHAUSEN",779184,6771,""]
[null,"MÖNCHSDEGGINGEN","ROHRBACH",779184,6772,""]
[null,"MÖNCHSROTH","DIEDERSTETTEN",571179,3673,""]
[null,"MÖNCHSROTH","MÖNCHSROTH",571179,3674,""]
[null,"MONHEIM","WEILHEIM",779186,6907,""]
[null,"MONHEIM","REHAU",779186,6908,""]
[null,"MONHEIM","WITTESHEIM",779186,6909,""]
[null,"MONHEIM","MONHEIM",779186,6910,""]
[null,"MONHEIM","FLOTZHEIM",779186,6911,""]
[null,"MONHEIM","RIED",779186,6912,""]
[null,"MONHEIM","WARCHING",779186,6913,""]
[null,"MONHEIM","ITZING",779186,6914,""]
[null,"MONHEIM","KÖLBURG",779186,6915,""]
[null,"MOORENWEIS","MOORENWEIS",179138,8484,""]
[null,"MOORENWEIS","DÜNZELBACH",179138,8485,""]
[null,"MOORENWEIS","EISMERSZELL",179138,8486,{"$f":"+IF(A4802<>\"\",1,\"\")","v":""}]
[null,"MOORENWEIS","GRUNERTSHOFEN",179138,8487,""]
[null,"MOORENWEIS","PURK",179138,8488,""]
[null,"MOORENWEIS","STEINBACH",179138,8489,""]
[null,"MOOS","LANGENISARHOFEN",271135,5936,""]
[null,"MOOS","MOOS",271135,5937,""]
[null,"MOOSACH","MOOSACH",175128,8767,""]
[null,"MOOSBACH","BURKHARDSRIETH",374137,4347,""]
[null,"MOOSBACH","BURGTRESWITZ",374137,4367,""]
[null,"MOOSBACH","GRÖBENSTÄDT",374137,4374,""]
[null,"MOOSBACH","HEUMADEN",374137,4375,""]
[null,"MOOSBACH","MOOSBACH",374137,4376,""]
[null,"MOOSBACH","NIEDERLAND",374137,4377,""]
[null,"MOOSBACH","ETZGERSRIETH",374137,4378,""]
[null,"MOOSBACH","TRÖBES",374137,4379,""]
[null,"MOOSBACH","RÜCKERSRIETH",374137,4380,""]
[null,"MOOSBACH","GAISHEIM",374137,4381,""]
[null,"MOOSBACH","TÄNNESBERG",374137,4412,""]
[null,"MOOSBURG A.D.ISAR","NIEDERAMBACH",178143,8294,""]
[null,"MOOSBURG A.D.ISAR","THONSTETTEN",178143,8295,""]
[null,"MOOSBURG A.D.ISAR","MOOSBURG A.D.ISAR",178143,8296,""]
[null,"MOOSBURG A.D.ISAR","PFROMBACH",178143,8297,""]
[null,"MOOSINNING","MOOSINNING",177130,8387,""]
[null,"MOOSTHENNING","DORNWANG",279128,6186,""]
[null,"MOOSTHENNING","LENGTHAL",279128,6187,""]
[null,"MOOSTHENNING","MOOSTHENNING",279128,6188,""]
[null,"MOOSTHENNING","OTTERING",279128,6189,""]
[null,"MOOSTHENNING","RIMBACH",279128,6190,""]
[null,"MOOSTHENNING","THÜRNTHENNING",279128,6191,""]
[null,"MÖRNSHEIM","MÜHLHEIM",176148,4046,""]
[null,"MÖRNSHEIM","MÖRNSHEIM",176148,4047,""]
[null,"MÖRNSHEIM","ALTENDORF",176148,4048,""]
[null,"MÖRNSHEIM","HAUNSFELD",176148,4049,""]
[null,"MÖRNSHEIM","ENSFELD",176148,4050,""]
[null,"MOTTEN","MOTTEN",672134,151,""]
[null,"MOTTEN","MOTTENER FORST-NORD",672134,152,""]
[null,"MOTTEN","MOTTENER FORST-WEST",672134,154,""]
[null,"MOTTEN","KOTHEN",672134,155,""]
[null,"MOTTEN","SPEICHERZ",672134,158,""]
[null,"MOTTEN","MOTTENER FORST-SÜD",672134,159,""]
[null,"MOTTENER FORST-SÜD","MOTTENER FORST-SÜD",672461,159,""]
[null,"MÖTTINGEN","ENKINGEN",779185,6756,""]
[null,"MÖTTINGEN","BALGHEIM",779185,6757,""]
[null,"MÖTTINGEN","MÖTTINGEN",779185,6758,""]
[null,"MÖTTINGEN","APPETSHOFEN",779185,6759,""]
[null,"MÖTTINGEN","KLEINSORHEIM",779185,6760,""]
[null,"MÖTZING","DENGLING",375171,5220,""]
[null,"MÖTZING","HAIMBUCH",375171,5254,""]
[null,"MÖTZING","MÖTZING",375171,5286,""]
[null,"MÖTZING","SCHÖNACH",375171,5325,""]
[null,"MÜHLDORF A.INN","ALTMÜHLDORF",183128,8841,""]
[null,"MÜHLDORF A.INN","MÖßLING",183128,8842,""]
[null,"MÜHLDORF A.INN","Hart",183128,8843,""]
[null,"MÜHLDORF A.INN","MÜHLDORF A.INN",183128,8844,""]
[null,"MÜHLDORFER HART","MÜHLDORFER HART",183451,8845,""]
[null,"MÜHLHAUSEN (LKR. ERH)","MÜHLHAUSEN",572143,2818,""]
[null,"MÜHLHAUSEN (LKR. ERH)","SCHIRNSDORF",572143,2832,""]
[null,"MÜHLHAUSEN (LKR. NM)","BACHHAUSEN",373146,4603,""]
[null,"MÜHLHAUSEN (LKR. NM)","DÖLLWANG",373146,4614,""]
[null,"MÜHLHAUSEN (LKR. NM)","KRUPPACH",373146,4637,""]
[null,"MÜHLHAUSEN (LKR. NM)","MÜHLHAUSEN",373146,4654,""]
[null,"MÜHLHAUSEN (LKR. NM)","OBERNDORF",373146,4658,""]
[null,"MÜHLHAUSEN (LKR. NM)","SULZBÜRG",373146,4691,""]
[null,"MÜHLHAUSEN (LKR. NM)","WAPPERSDORF",373146,4702,""]
[null,"MUHR A.SEE","ALTENMUHR",577114,3616,{"$f":"+IF(A4866<>\"\",1,\"\")","v":""}]
[null,"MUHR A.SEE","NEUENMUHR",577114,3617,""]
[null,"MÜNCHBERG","MARKERSREUTH",475154,1897,""]
[null,"MÜNCHBERG","POPPENREUTH",475154,1936,""]
[null,"MÜNCHBERG","MEIERHOF B.MÜNCHBERG",475154,1937,""]
[null,"MÜNCHBERG","MÜNCHBERG",475154,1938,""]
[null,"MÜNCHBERG","MECHLENREUTH",475154,1939,""]
[null,"MÜNCHBERG","SAUERHOF",475154,1940,""]
[null,"MÜNCHBERG","STRAAS",475154,1941,""]
[null,"MÜNCHBERG","MÜNCHBERG BERGWERK",475154,1992,""]
[null,"MÜNCHEN","MÜNCHEN 1",162000,8651,""]
[null,"MÜNCHEN","MÜNCHEN, S.2",162000,8652,""]
[null,"MÜNCHEN","MÜNCHEN, S.3",162000,8653,""]
[null,"MÜNCHEN","MÜNCHEN, S.4",162000,8654,""]
[null,"MÜNCHEN","MÜNCHEN, S.5",162000,8655,""]
[null,"MÜNCHEN","MÜNCHEN, S.6",162000,8656,""]
[null,"MÜNCHEN","MÜNCHEN, S.7",162000,8657,""]
[null,"MÜNCHEN","MÜNCHEN, S.8",162000,8658,""]
[null,"MÜNCHEN","MÜNCHEN, S.9",162000,8659,""]
[null,"MÜNCHEN","ALLACH",162000,8660,""]
[null,"MÜNCHEN","AUBING",162000,8662,""]
[null,"MÜNCHEN","BERG AM LAIM",162000,8663,""]
[null,"MÜNCHEN","BOGENHAUSEN",162000,8664,""]
[null,"MÜNCHEN","DAGLFING",162000,8666,""]
[null,"MÜNCHEN","FELDMOCHING",162000,8669,""]
[null,"MÜNCHEN","FREIMANN",162000,8670,""]
[null,"MÜNCHEN","FORSTENRIED",162000,8671,""]
[null,"MÜNCHEN","GROßHADERN",162000,8675,""]
[null,"MÜNCHEN","LAIM",162000,8684,""]
[null,"MÜNCHEN","LANGWIED",162000,8685,""]
[null,"MÜNCHEN","LUDWIGSFELD",162000,8686,""]
[null,"MÜNCHEN","MILBERTSHOFEN",162000,8687,""]
[null,"MÜNCHEN","MOOSACH",162000,8688,""]
[null,"MÜNCHEN","NEUHAUSEN",162000,8689,""]
[null,"MÜNCHEN","NEURIED",162000,8690,""]
[null,"MÜNCHEN","NYMPHENBURG",162000,8691,""]
[null,"MÜNCHEN","OBERFÖHRING",162000,8692,""]
[null,"MÜNCHEN","OBERMENZING",162000,8694,""]
[null,"MÜNCHEN","PASING",162000,8696,""]
[null,"MÜNCHEN","PERLACH",162000,8698,""]
[null,"MÜNCHEN","SCHWABING",162000,8702,""]
[null,"MÜNCHEN","SOLLN",162000,8704,""]
[null,"MÜNCHEN","THALKIRCHEN",162000,8706,""]
[null,"MÜNCHEN","TRUDERING",162000,8707,""]
[null,"MÜNCHEN","UNTERMENZING",162000,8711,""]
[null,"MÜNCHEN","MÜNCHEN, REALGEWERBE",162000,8739,""]
[null,"MÜNCHEN","SCHÖNFELDVORSTADT",162000,8740,""]
[null,"MÜNCHEN","SANKT-ANNA-VORSTADT",162000,8741,""]
[null,"MÜNCHEN","MAXVORSTADT",162000,8742,""]
[null,"MÜNCHEN","UNTERSENDLING",162000,8743,""]
[null,"MÜNCHEN","LUDWIGVORSTADT",162000,8744,""]
[null,"MÜNCHEN","ISARVORSTADT",162000,8745,""]
[null,"MÜNCHEN","GIESING",162000,8746,""]
[null,"MÜNCHEN","AU",162000,8747,""]
[null,"MÜNCHEN","HAIDHAUSEN",162000,8748,""]
[null,"MÜNCHSMÜNSTER","OBERWÖHR",186139,8157,""]
[null,"MÜNCHSMÜNSTER","MÜNCHSMÜNSTER",186139,8158,""]
[null,"MÜNCHSTEINACH","MÜNCHSTEINACH",575150,3256,""]
[null,"MÜNCHSTEINACH","ABTSGREUTH",575150,3257,""]
[null,"MÜNCHSTEINACH","ALTERSHAUSEN",575150,3258,""]
[null,"MÜNCHSTEINACH","NEUEBERSBACH",575150,3259,""]
[null,"MÜNNERSTADT","BILDHAUSEN-NORDOST",672135,185,""]
[null,"MÜNNERSTADT","BILDHAUSEN-SÜDWEST",672135,193,""]
[null,"MÜNNERSTADT","WINDHEIM/MÜNNERSTADT",672135,205,""]
[null,"MÜNNERSTADT","REICHENBACH",672135,206,{"$f":"+IF(A4930<>\"\",1,\"\")","v":""}]
[null,"MÜNNERSTADT","FRIDRITT",672135,207,""]
[null,"MÜNNERSTADT","KLEINWENKHEIM",672135,208,""]
[null,"MÜNNERSTADT","GROßWENKHEIM",672135,209,""]
[null,"MÜNNERSTADT","BURGHAUSEN",672135,217,""]
[null,"MÜNNERSTADT","ALTHAUSEN",672135,218,""]
[null,"MÜNNERSTADT","MÜNNERSTADT",672135,223,""]
[null,"MÜNNERSTADT","BRÜNN",672135,224,""]
[null,"MÜNNERSTADT","WERMERICHSHAUSEN",672135,229,""]
[null,"MÜNNERSTADT","SEUBRIGSHAUSEN",672135,234,""]
[null,"MÜNNERSTADT","GRESSERTSHOF",672135,239,""]
[null,"MUNNINGEN","MUNNINGEN",779188,6722,""]
[null,"MUNNINGEN","SCHWÖRSHEIM",779188,6723,""]
[null,"MUNNINGEN","LAUB",779188,6724,""]
[null,"MÜNSING","MÜNSING",173137,9318,""]
[null,"MÜNSING","HOLZHAUSEN A.STARNBERGER SEE",173137,9319,""]
[null,"MÜNSING","DEGERNDORF",173137,9320,""]
[null,"MÜNSING","EURASBURG",173137,9333,""]
[null,"MÜNSTER","MÜNSTER",779187,6976,""]
[null,"MÜNSTERHAUSEN","HAGENRIED",774160,7724,""]
[null,"MÜNSTERHAUSEN","MÜNSTERHAUSEN",774160,7725,""]
[null,"MURNAU A.STAFFELSEE","MURNAU A.STAFFELSEE",180124,9242,""]
[null,"MURNAU A.STAFFELSEE","WEINDORF",180124,9243,""]
[null,"MURNAU A.STAFFELSEE","HECHENDORF",180124,9244,""]
[null,"NABBURG","IFFELSDORF",376144,4812,""]
[null,"NABBURG","PAMSENDORF",376144,4817,""]
[null,"NABBURG","GÖSSELSDORF",376144,4852,""]
[null,"NABBURG","HAINDORF",376144,4859,""]
[null,"NABBURG","PERSCHEN",376144,4860,""]
[null,"NABBURG","NEUSATH",376144,4861,""]
[null,"NABBURG","BRUDERSDORF",376144,4862,""]
[null,"NABBURG","NABBURG",376144,4863,""]
[null,"NABBURG","DIENDORF",376144,4864,""]
[null,"NABBURG","BERGWERK",376144,4880,""]
[null,"NAGEL","NAGEL",479138,2064,""]
[null,"NAILA","FROSCHGRÜN",475156,1911,""]
[null,"NAILA","NAILA",475156,1912,""]
[null,"NAILA","MARXGRÜN",475156,1913,""]
[null,"NAILA","CULMITZ",475156,1914,""]
[null,"NAILA","LIPPERTSGRÜN",475156,1915,""]
[null,"NAILA","MARLESREUTH",475156,1916,""]
[null,"NAILA","FORST SCHWARZENBACH A.WALD",475156,1923,""]
[null,"NAILA","NAILA BERGWERK",475156,1993,""]
[null,"NANDLSTADT","AIRISCHWAND",178144,8265,""]
[null,"NANDLSTADT","NANDLSTADT",178144,8266,""]
[null,"NANDLSTADT","FIGLSDORF",178144,8267,""]
[null,"NANDLSTADT","BAUMGARTEN",178144,8268,""]
[null,"NASSENFELS","WOLKERTSHOFEN",176149,4059,""]
[null,"NASSENFELS","NASSENFELS",176149,4060,""]
[null,"NASSENFELS","MEILENHOFEN",176149,4061,""]
[null,"NENNSLINGEN","NENNSLINGEN",577151,3726,""]
[null,"NENNSLINGEN","WENGEN",577151,3727,""]
[null,"NENNSLINGEN","GERSDORF",577151,3728,""]
[null,"NENNSLINGEN","BIBURG",577151,3729,""]
[null,"NERSINGEN","LEIBI",775134,7063,""]
[null,"NERSINGEN","NERSINGEN",775134,7064,""]
[null,"NERSINGEN","OBERFAHLHEIM",775134,7065,""]
[null,"NERSINGEN","UNTERFAHLHEIM",775134,7066,""]
[null,"NERSINGEN","STRAß",775134,7067,""]
[null,"NESSELWANG","SCHNEIDBACH",777153,7908,""]
[null,"NESSELWANG","NESSELWANG",777153,7909,""]
[null,"NEUALBENREUTH","PFAFFENREUTH",377142,4119,""]
[null,"NEUALBENREUTH","WERNERSREUTH",377142,4122,""]
[null,"NEUALBENREUTH","OTTENGRÜN",377142,4123,""]
[null,"NEUALBENREUTH","NEUALBENREUTH",377142,4124,{"$f":"+IF(A4994<>\"\",1,\"\")","v":""}]
[null,"NEUBAUER FORST-NORD","NEUBAUER FORST-NORD",472463,2372,""]
[null,"NEUBAUER FORST-SÜD","NEUBAUER FORST-SÜD",479457,2059,""]
[null,"NEUBEUERN","ALTENBEUERN",187154,9602,""]
[null,"NEUBEUERN","NEUBEUERN",187154,9651,""]
[null,"NEUBIBERG","UNTERBIBERG",184146,8708,""]
[null,"NEUBRUNN","NEUBRUNN",679164,711,""]
[null,"NEUBRUNN","BÖTTIGHEIM",679164,717,""]
[null,"NEUBURG A.D.DONAU","HEIMBERG",185149,8070,""]
[null,"NEUBURG A.D.DONAU","BERGEN",185149,8071,""]
[null,"NEUBURG A.D.DONAU","RIED",185149,8072,""]
[null,"NEUBURG A.D.DONAU","BITTENBRUNN",185149,8073,""]
[null,"NEUBURG A.D.DONAU","JOSHOFEN",185149,8074,""]
[null,"NEUBURG A.D.DONAU","NEUBURG A.D.DONAU",185149,8075,""]
[null,"NEUBURG A.D.DONAU","HEINRICHSHEIM",185149,8076,""]
[null,"NEUBURG A.D.DONAU","FELDKIRCHEN",185149,8077,""]
[null,"NEUBURG A.D.DONAU","ZELL",185149,8078,""]
[null,"NEUBURG A.D.DONAU","BRUCK",185149,8079,""]
[null,"NEUBURG A.D.KAMMEL","WATTENWEILER",774162,7179,""]
[null,"NEUBURG A.D.KAMMEL","LANGENHASLACH",774162,7180,""]
[null,"NEUBURG A.D.KAMMEL","NEUBURG A.D.KAMMEL",774162,7181,""]
[null,"NEUBURG A.D.KAMMEL","EDELSTETTEN",774162,7182,""]
[null,"NEUBURG A.INN","ENGERTSHAM",275133,6361,""]
[null,"NEUBURG A.INN","NEUKIRCHEN A.INN",275133,6362,""]
[null,"NEUBURG A.INN","NEUBURG A.INN",275133,6363,""]
[null,"NEUBURG A.INN","EGLSEE",275133,6364,""]
[null,"NEUCHING","NIEDERNEUCHING",177131,8388,""]
[null,"NEUCHING","OBERNEUCHING",177131,8389,""]
[null,"NEUDROSSENFELD","LEUCHAU",477142,1759,""]
[null,"NEUDROSSENFELD","LINDAU",477142,1767,""]
[null,"NEUDROSSENFELD","LIMMERSDORFER FORST",477142,1800,""]
[null,"NEUDROSSENFELD","LANGENSTADT",477142,1801,""]
[null,"NEUDROSSENFELD","NEUENREUTH A.MAIN",477142,1802,""]
[null,"NEUDROSSENFELD","BRÜCKLEIN",477142,1803,""]
[null,"NEUDROSSENFELD","NEUDROSSENFELD",477142,1804,""]
[null,"NEUDROSSENFELD","PECHGRABEN",477142,1805,""]
[null,"NEUDROSSENFELD","MUCKENREUTH",477142,1806,""]
[null,"NEUDROSSENFELD","ALTDROSSENFELD",477142,1807,""]
[null,"NEUENDETTELSAU","AICH",571180,3101,""]
[null,"NEUENDETTELSAU","BECHHOFEN B.NEUENDETTELSAU",571180,3110,""]
[null,"NEUENDETTELSAU","HAAG",571180,3151,""]
[null,"NEUENDETTELSAU","NEUENDETTELSAU",571180,3193,""]
[null,"NEUENDETTELSAU","WERNSBACH",571180,3240,""]
[null,"NEUENDETTELSAU","WOLLERSDORF",571180,3247,""]
[null,"NEUENDORF","NEUENDORF",677164,538,""]
[null,"NEUENHAMMER","WALDKIRCH",374455,4338,""]
[null,"NEUENHAMMER","NEUDORF",374455,4339,""]
[null,"NEUENMARKT","HEGNABRUNN",477143,1770,""]
[null,"NEUENMARKT","NEUENMARKT",477143,1771,""]
[null,"NEUENSORGER FORST","NEUENSORGER FORST",478453,1427,""]
[null,"NEUFAHRN B.FREISING","MASSENHAUSEN",178145,8330,""]
[null,"NEUFAHRN B.FREISING","GIGGENHAUSEN",178145,8331,""]
[null,"NEUFAHRN B.FREISING","NEUFAHRN B.FREISING",178145,8332,""]
[null,"NEUFAHRN I.NB","NIEDERRONING",274153,6556,""]
[null,"NEUFAHRN I.NB","HEBRAMSDORF",274153,6557,""]
[null,"NEUFAHRN I.NB","NEUFAHRN I.NB",274153,6558,""]
[null,"NEUFAHRN I.NB","ROHRBERG",274153,6559,""]
[null,"NEUFRAUNHOFEN","NEUFRAUNHOFEN",274154,6671,""]
[null,"NEUFRAUNHOFEN","VILSLERN",274154,6672,""]
[null,"NEUHAUS A.D.PEGNITZ","HÖFEN",574140,3537,""]
[null,"NEUHAUS A.D.PEGNITZ","KROTTENSEE",574140,3547,""]
[null,"NEUHAUS A.D.PEGNITZ","NEUHAUS A.D.PEGNITZ",574140,3551,""]
[null,"NEUHAUS A.D.PEGNITZ","ROTHENBRUCK",574140,3566,""]
[null,"NEUHAUS A.D.PEGNITZ","KROTTENSEE NEUHAUS/PEGNITZ",574140,3588,""]
[null,"NEUHAUS A.INN","EGLSEE",275134,6364,{"$f":"+IF(A5058<>\"\",1,\"\")","v":""}]
[null,"NEUHAUS A.INN","VORNBACH",275134,6379,""]
[null,"NEUHAUS A.INN","NEUHAUS A.INN",275134,6380,""]
[null,"NEUHAUS A.INN","MITTICH",275134,6381,""]
[null,"NEUHAUSER FORST","NEUHAUSER FORST",674455,1006,""]
[null,"NEUHOF A.D.ZENN","NEUHOF A.D.ZENN",575152,3317,""]
[null,"NEUHOF A.D.ZENN","NEUZIEGENRÜCK",575152,3318,""]
[null,"NEUHOF A.D.ZENN","OBERFELDBRECHT",575152,3319,""]
[null,"NEUHOF A.D.ZENN","HIRSCHNEUSES",575152,3320,""]
[null,"NEUHÜTTEN","NEUHÜTTEN",677165,534,""]
[null,"NEUHÜTTEN","FORST LOHRERSTRAßE",677165,551,""]
[null,"NEUKIRCHEN","NEUKIRCHEN",278154,5590,""]
[null,"NEUKIRCHEN","OBERMÜHLBACH",278154,5591,""]
[null,"NEUKIRCHEN B.HL.BLUT","WARZENRIED",372144,5064,""]
[null,"NEUKIRCHEN B.HL.BLUT","VORDERBUCHBERG",372144,5066,""]
[null,"NEUKIRCHEN B.HL.BLUT","NEUKIRCHEN B.HL.BLUT",372144,5067,""]
[null,"NEUKIRCHEN B.HL.BLUT","ATZLERN",372144,5068,""]
[null,"NEUKIRCHEN B.HL.BLUT","RITTSTEIG",372144,5069,""]
[null,"NEUKIRCHEN B.HL.BLUT","KOLMSTEIN",372144,5070,""]
[null,"NEUKIRCHEN B.SULZB.R","MITTELREINBACH",371141,4468,""]
[null,"NEUKIRCHEN B.SULZB.R","HOLNSTEIN",371141,4469,""]
[null,"NEUKIRCHEN B.SULZB.R","NEUKIRCHEN B.SULZBACH-ROSENBG.",371141,4481,""]
[null,"NEUKIRCHEN B.SULZB.R","RÖCKENRICHT",371141,4482,""]
[null,"NEUKIRCHEN B.SULZB.R","BACHETSFELD",371141,4496,""]
[null,"NEUKIRCHEN B.SULZB.R","TRONDORF",371141,4497,""]
[null,"NEUKIRCHEN VORM WALD","NEUKIRCHEN VORM WALD",275135,6304,""]
[null,"NEUKIRCHEN-BALBINI","KLEINWINKLARN",376146,4927,""]
[null,"NEUKIRCHEN-BALBINI","BODENWÖHRER FORST",376146,4929,""]
[null,"NEUKIRCHEN-BALBINI","NEUKIRCHEN-BALBINI",376146,4933,""]
[null,"NEUKIRCHEN-BALBINI","BODEN",376146,4934,""]
[null,"NEUKIRCHEN-BALBINI","EGELSRIED",376146,4935,""]
[null,"NEUKIRCHEN-BALBINI","HANSENRIED",376146,4936,""]
[null,"NEUKIRCHEN-BALBINI","ALLETSRIED",376146,4937,""]
[null,"NEUMARKT I.D.OPF.","HELENA",373147,4632,""]
[null,"NEUMARKT I.D.OPF.","HOLZHEIM",373147,4636,""]
[null,"NEUMARKT I.D.OPF.","LABERSRICHT",373147,4639,""]
[null,"NEUMARKT I.D.OPF.","LIPPERTSHOFEN",373147,4644,""]
[null,"NEUMARKT I.D.OPF.","MÜHLEN",373147,4653,""]
[null,"NEUMARKT I.D.OPF.","NEUMARKT I.D.OPF.",373147,4655,""]
[null,"NEUMARKT I.D.OPF.","PELCHENHOFEN",373147,4664,""]
[null,"NEUMARKT I.D.OPF.","PÖLLING",373147,4670,""]
[null,"NEUMARKT I.D.OPF.","STAUF",373147,4687,""]
[null,"NEUMARKT I.D.OPF.","WOFFENBACH",373147,4704,""]
[null,"NEUMARKT-ST. VEIT","WIESBACH",183129,8801,""]
[null,"NEUMARKT-ST. VEIT","THAMBACH",183129,8802,""]
[null,"NEUMARKT-ST. VEIT","ELSENBACH",183129,8804,""]
[null,"NEUMARKT-ST. VEIT","FEICHTEN",183129,8807,""]
[null,"NEUMARKT-ST. VEIT","HÖRBERING",183129,8808,""]
[null,"NEUMARKT-ST. VEIT","WOLFSBERG",183129,8809,""]
[null,"NEUMARKT-ST. VEIT","NEUMARKT",183129,8810,""]
[null,"NEUMARKT-ST. VEIT","SANKT VEIT",183129,8811,""]
[null,"NEUNBURG VORM WALD","NEUNBURG VORM WALD",376147,4915,""]
[null,"NEUNBURG VORM WALD","EIXENDORF",376147,4916,""]
[null,"NEUNBURG VORM WALD","FUHRN",376147,4917,""]
[null,"NEUNBURG VORM WALD","KATZDORF IN NEUNBURG V. W.",376147,4918,""]
[null,"NEUNBURG VORM WALD","KEMNATH B.FUHRN",376147,4919,""]
[null,"NEUNBURG VORM WALD","KRÖBLITZ",376147,4920,""]
[null,"NEUNBURG VORM WALD","LENGFELD",376147,4921,""]
[null,"NEUNBURG VORM WALD","MEIßENBERG",376147,4922,""]
[null,"NEUNBURG VORM WALD","MITTERASCHAU",376147,4923,""]
[null,"NEUNBURG VORM WALD","PENTING",376147,4924,""]
[null,"NEUNBURG VORM WALD","SEEBARN",376147,4925,""]
[null,"NEUNBURG VORM WALD","THANN",376147,4926,""]
[null,"NEUNBURG VORM WALD","KLEINWINKLARN",376147,4927,""]
[null,"NEUNBURG VORM WALD","ALLETSRIED",376147,4937,{"$f":"+IF(A5122<>\"\",1,\"\")","v":""}]
[null,"NEUNHOFER FORST","NEUNHOFER FORST",572460,2822,""]
[null,"NEUNKIRCHEN","UMPFENBACH",676143,458,""]
[null,"NEUNKIRCHEN","NEUNKIRCHEN",676143,459,""]
[null,"NEUNKIRCHEN","RICHELBACH",676143,460,""]
[null,"NEUNKIRCHEN A.BRAND","HETZLES",474154,2704,""]
[null,"NEUNKIRCHEN A.BRAND","ERMREUTH",474154,2705,""]
[null,"NEUNKIRCHEN A.BRAND","RÖDLAS",474154,2706,""]
[null,"NEUNKIRCHEN A.BRAND","NEUNKIRCHEN A.BRAND",474154,2707,""]
[null,"NEUNKIRCHEN A.BRAND","GROßENBUCH",474154,2708,""]
[null,"NEUNKIRCHEN A.BRAND","ROSENBACH",474154,2709,""]
[null,"NEUNKIRCHEN A.BRAND","DORMITZ",474154,2710,""]
[null,"NEUNKIRCHEN A.SAND","KERSBACH",574141,3543,""]
[null,"NEUNKIRCHEN A.SAND","NEUNKIRCHEN A.SAND",574141,3553,""]
[null,"NEUNKIRCHEN A.SAND","ROLLHOFEN",574141,3565,""]
[null,"NEUNKIRCHEN A.SAND","SPEIKERN",574141,3575,""]
[null,"NEUÖTTING","ALZGERN",171125,8902,""]
[null,"NEUÖTTING","NEUÖTTING",171125,8923,""]
[null,"NEUÖTTING","ALZGERNER FORST",171125,8947,""]
[null,"NEUREICHENAU","FRAUENBERG",272136,5852,""]
[null,"NEUREICHENAU","ALTREICHENAU",272136,5868,""]
[null,"NEUREICHENAU","NEUREICHENAU",272136,5869,""]
[null,"NEUREICHENAU","LACKENHÄUSER",272136,5870,""]
[null,"NEUREICHENAU","GSENGET",272136,5879,""]
[null,"NEUREICHENAU","KLAFFERSTRAß",272136,5880,""]
[null,"NEURIED","FORSTENRIED",184132,8671,""]
[null,"NEURIED","NEURIED",184132,8690,""]
[null,"NEUSÄß","NEUSÄß",772184,7250,""]
[null,"NEUSÄß","HAMMEL",772184,7251,""]
[null,"NEUSÄß","TÄFERTINGEN",772184,7252,""]
[null,"NEUSÄß","OTTMARSHAUSEN",772184,7253,""]
[null,"NEUSÄß","HAINHOFEN",772184,7254,""]
[null,"NEUSÄß","WESTHEIM B.AUGSBURG",772184,7255,""]
[null,"NEUSÄß","SCHLIPSHEIM",772184,7256,""]
[null,"NEUSÄß","STEPPACH B.AUGSBURG",772184,7257,""]
[null,"NEUSCHÖNAU","NEUSCHÖNAU",272146,5806,""]
[null,"NEUSITZ","NEUSITZ",571181,3001,""]
[null,"NEUSITZ","SCHWEINSDORF",571181,3031,""]
[null,"NEUSORG","NEUSORG",377143,4203,""]
[null,"NEUSORG","RIGLASREUTH",377143,4204,""]
[null,"NEUSTADT A.D.AISCH","OBERNESSELBACH",575153,3009,""]
[null,"NEUSTADT A.D.AISCH","UNTERNESSELBACH",575153,3049,""]
[null,"NEUSTADT A.D.AISCH","DIESPECK",575153,3265,""]
[null,"NEUSTADT A.D.AISCH","NEUSTADT A.D.AISCH",575153,3282,""]
[null,"NEUSTADT A.D.AISCH","DIEBACH",575153,3283,""]
[null,"NEUSTADT A.D.AISCH","SCHAUERHEIM",575153,3284,""]
[null,"NEUSTADT A.D.AISCH","BIRKENFELD",575153,3285,""]
[null,"NEUSTADT A.D.AISCH","UNTERSCHWEINACH",575153,3286,""]
[null,"NEUSTADT A.D.AISCH","HERRNNEUSES",575153,3287,""]
[null,"NEUSTADT A.D.AISCH","SCHELLERT",575153,3288,""]
[null,"NEUSTADT A.D.DONAU","ARRESTING",273152,6009,""]
[null,"NEUSTADT A.D.DONAU","BAD GÖGGING",273152,6013,""]
[null,"NEUSTADT A.D.DONAU","EINING",273152,6019,""]
[null,"NEUSTADT A.D.DONAU","GEIBENSTETTEN",273152,6024,""]
[null,"NEUSTADT A.D.DONAU","HIENHEIM",273152,6034,""]
[null,"NEUSTADT A.D.DONAU","IRNSING",273152,6041,""]
[null,"NEUSTADT A.D.DONAU","MARCHING",273152,6054,""]
[null,"NEUSTADT A.D.DONAU","MAUERN",273152,6055,""]
[null,"NEUSTADT A.D.DONAU","MÜHLHAUSEN",273152,6060,""]
[null,"NEUSTADT A.D.DONAU","NEUSTADT A.D.DONAU",273152,6063,""]
[null,"NEUSTADT A.D.DONAU","OBERULRAIN",273152,6071,""]
[null,"NEUSTADT A.D.DONAU","SCHWAIG",273152,6091,""]
[null,"NEUSTADT A.D.WALDNAA","ALTENSTADT A.D.WALDNAAB",374139,4354,""]
[null,"NEUSTADT A.D.WALDNAA","NEUSTADT A.D.WALDNAAB",374139,4355,""]
[null,"NEUSTADT A.KULM","MOCKERSDORF",374140,4254,{"$f":"+IF(A5186<>\"\",1,\"\")","v":""}]
[null,"NEUSTADT A.KULM","NEUSTADT AM KULM",374140,4255,""]
[null,"NEUSTADT A.KULM","FILCHENDORF",374140,4256,""]
[null,"NEUSTADT A.MAIN","NEUSTADT A.MAIN",677166,575,""]
[null,"NEUSTADT A.MAIN","ERLACH A.MAIN",677166,576,""]
[null,"NEUSTADT B.COBURG","AICHA",473151,1303,""]
[null,"NEUSTADT B.COBURG","BIRKIG",473151,1313,""]
[null,"NEUSTADT B.COBURG","BODERNDORF",473151,1316,""]
[null,"NEUSTADT B.COBURG","BRÜX",473151,1320,""]
[null,"NEUSTADT B.COBURG","BRÜXER FORST",473151,1321,""]
[null,"NEUSTADT B.COBURG","EBERSDORF",473151,1340,""]
[null,"NEUSTADT B.COBURG","FECHHEIM",473151,1345,""]
[null,"NEUSTADT B.COBURG","FÜRTH A.BERG",473151,1353,""]
[null,"NEUSTADT B.COBURG","HAARBRÜCKEN",473151,1367,""]
[null,"NEUSTADT B.COBURG","HÖHN",473151,1377,""]
[null,"NEUSTADT B.COBURG","HORB B.FÜRTH A.BERG",473151,1379,""]
[null,"NEUSTADT B.COBURG","KEMMATEN",473151,1383,""]
[null,"NEUSTADT B.COBURG","KETSCHENBACH",473151,1384,""]
[null,"NEUSTADT B.COBURG","MEILSCHNITZ",473151,1409,""]
[null,"NEUSTADT B.COBURG","MITTELWASUNGEN",473151,1418,""]
[null,"NEUSTADT B.COBURG","NEUSTADT B.COBURG",473151,1433,""]
[null,"NEUSTADT B.COBURG","NEUSTADTER FORST",473151,1434,""]
[null,"NEUSTADT B.COBURG","PLESTEN",473151,1451,""]
[null,"NEUSTADT B.COBURG","RÜTTMANNSDORF",473151,1466,""]
[null,"NEUSTADT B.COBURG","THANN",473151,1494,""]
[null,"NEUSTADT B.COBURG","UNTERWASUNGEN",473151,1508,""]
[null,"NEUSTADT B.COBURG","WEIMERSDORF",473151,1517,""]
[null,"NEUSTADT B.COBURG","WELLMERSDORF",473151,1523,""]
[null,"NEUSTADT B.COBURG","WILDENHEID",473151,1527,""]
[null,"NEUTRAUBLING","NEUTRAUBLING",375174,5289,""]
[null,"NEU-ULM","NEU-ULM",775135,7054,""]
[null,"NEU-ULM","PFUHL",775135,7055,""]
[null,"NEU-ULM","BURLAFINGEN",775135,7056,""]
[null,"NEU-ULM","STEINHEIM",775135,7057,""]
[null,"NEU-ULM","FINNINGEN",775135,7058,""]
[null,"NEU-ULM","REUTTI",775135,7059,""]
[null,"NEU-ULM","GERLENHOFEN",775135,7060,""]
[null,"NEU-ULM","HAUSEN/NU",775135,7061,""]
[null,"NEU-ULM","HOLZSCHWANG",775135,7062,""]
[null,"NEU-ULM","NEU-ULM, FORST",775135,7184,""]
[null,"NEUWIRTSHAUSER FORST","NEUWIRTSHAUSER FORST",672462,236,""]
[null,"NIEDERAICHBACH","NIEDERAICHBACH",274156,6603,""]
[null,"NIEDERAICHBACH","HÜTTENKOFEN",274156,6604,""]
[null,"NIEDERAICHBACH","WOLFSBACH",274156,6605,""]
[null,"NIEDERAICHBACH","OBERAICHBACH",274156,6606,""]
[null,"NIEDERALTEICH","NIEDERALTEICH",271138,5940,""]
[null,"NIEDERBERGKIRCHEN","NIEDERBERGKIRCHEN",183130,8819,""]
[null,"NIEDERBERGKIRCHEN","OBERHOFEN",183130,8822,""]
[null,"NIEDERFÜLLBACH","NIEDERFÜLLBACH",473153,1436,""]
[null,"NIEDERLAUER","UNTEREBERSBACH",673146,87,""]
[null,"NIEDERLAUER","OBEREBERSBACH",673146,101,""]
[null,"NIEDERLAUER","NIEDERLAUER",673146,102,""]
[null,"NIEDERMURACH","ROTTENDORF IN NIEDERMURACH",376148,4824,""]
[null,"NIEDERMURACH","NIEDERMURACH",376148,4825,""]
[null,"NIEDERMURACH","NOTTERSDORF",376148,4826,""]
[null,"NIEDERMURACH","PERTOLZHOFEN",376148,4827,""]
[null,"NIEDERMURACH","WAGNERN",376148,4828,""]
[null,"NIEDERNBERG","NIEDERNBERG",676144,401,""]
[null,"NIEDERRIEDEN","NIEDERRIEDEN",778177,7554,""]
[null,"NIEDERSCHÖNENFELD","FELDHEIM",779192,6960,""]
[null,"NIEDERTAUFKIRCHEN","NIEDERTAUFKIRCHEN",183131,8820,""]
[null,"NIEDERTAUFKIRCHEN","ROßBACH",183131,8821,""]
[null,"NIEDERVIEHBACH","NIEDERVIEHBACH",279130,6193,""]
[null,"NIEDERVIEHBACH","OBERVIEHBACH",279130,6194,""]
[null,"NIEDERWERRN","OBERWERRN",678160,872,{"$f":"+IF(A5250<>\"\",1,\"\")","v":""}]
[null,"NIEDERWERRN","NIEDERWERRN",678160,873,""]
[null,"NIEDERWINKLING","NIEDERWINKLING",278159,5629,""]
[null,"NIEDERWINKLING","WALTENDORF",278159,5643,""]
[null,"NITTENAU","SOLLBACH",376149,4943,""]
[null,"NITTENAU","KASPELTSHUB",376149,4944,""]
[null,"NITTENAU","NITTENAU",376149,4945,""]
[null,"NITTENAU","BERGHAM",376149,4946,""]
[null,"NITTENAU","BLEICH",376149,4947,""]
[null,"NITTENAU","BODENSTEIN",376149,4948,""]
[null,"NITTENAU","FISCHBACH",376149,4949,""]
[null,"NITTENAU","HOF A.REGEN",376149,4950,""]
[null,"NITTENAU","NEUHAUS",376149,4951,""]
[null,"NITTENAU","STEFLING",376149,4952,""]
[null,"NITTENAU","TREIDLING",376149,4953,""]
[null,"NITTENAU","UNTERMAINSBACH",376149,4954,""]
[null,"NITTENDORF","EICHHOFEN",375175,5225,""]
[null,"NITTENDORF","ETTERZHAUSEN",375175,5230,""]
[null,"NITTENDORF","HAUGENRIED",375175,5257,""]
[null,"NITTENDORF","NITTENDORF",375175,5292,""]
[null,"NITTENDORF","SCHÖNHOFEN",375175,5326,""]
[null,"NONNENHORN","NONNENHORN",776120,7931,""]
[null,"NONNENKLOSTER","MICHELAU I.STEIGERWALD",678454,1039,""]
[null,"NORDENDORF","NORDENDORF",772185,6987,""]
[null,"NORDENDORF","BLANKENBURG",772185,6988,""]
[null,"NORDHALBEN","NORDHALBEN",476159,1589,""]
[null,"NORDHALBEN","HEINERSBERG",476159,1590,""]
[null,"NORDHEIM A.MAIN","NORDHEIM A.MAIN",675155,1110,""]
[null,"NORDHEIM V.D.RHÖN","NEUSTÄDTLES",673147,13,""]
[null,"NORDHEIM V.D.RHÖN","NORDHEIM V.D.RHÖN",673147,18,""]
[null,"NÖRDL.STEINWALD","PULLENREUTH",377456,4210,""]
[null,"NÖRDL.STEINWALD","LOCHAU",377456,4211,""]
[null,"NÖRDLINGEN","DÜRRENZIMMERN",779194,6733,""]
[null,"NÖRDLINGEN","PFÄFFLINGEN",779194,6734,""]
[null,"NÖRDLINGEN","LÖPSINGEN",779194,6735,""]
[null,"NÖRDLINGEN","BALDINGEN",779194,6736,""]
[null,"NÖRDLINGEN","NÖRDLINGEN",779194,6737,""]
[null,"NÖRDLINGEN","NÄHERMEMMINGEN",779194,6738,""]
[null,"NÖRDLINGEN","KLEINERDLINGEN",779194,6739,""]
[null,"NÖRDLINGEN","HOLHEIM",779194,6740,""]
[null,"NÖRDLINGEN","HERKHEIM",779194,6741,""]
[null,"NÖRDLINGEN","GROSSELFINGEN",779194,6742,""]
[null,"NÖRDLINGEN","SCHMÄHINGEN",779194,6743,""]
[null,"NÜDLINGEN","HAARD",672136,222,""]
[null,"NÜDLINGEN","NÜDLINGEN",672136,238,""]
[null,"NÜRNBERG","ALMOSHOF",564000,3401,""]
[null,"NÜRNBERG","BOXDORF",564000,3405,""]
[null,"NÜRNBERG","BRUNN",564000,3406,""]
[null,"NÜRNBERG","BUCH",564000,3407,""]
[null,"NÜRNBERG","EIBACH",564000,3411,""]
[null,"NÜRNBERG","EIBACHER FORST",564000,3412,""]
[null,"NÜRNBERG","ERLENSTEGEN",564000,3415,""]
[null,"NÜRNBERG","FISCHBACH B.NÜRNBERG",564000,3418,""]
[null,"NÜRNBERG","GÄRTEN B.WÖHRD",564000,3419,""]
[null,"NÜRNBERG","GÄRTEN H.D.VESTE",564000,3420,""]
[null,"NÜRNBERG","GALGENHOF",564000,3421,""]
[null,"NÜRNBERG","GIBITZENHOF",564000,3423,""]
[null,"NÜRNBERG","GLEIßHAMMER",564000,3424,""]
[null,"NÜRNBERG","GOSTENHOF",564000,3425,""]
[null,"NÜRNBERG","GROßGRÜNDLACH",564000,3426,""]
[null,"NÜRNBERG","GROßREUTH B.SCHWEINAU",564000,3427,""]
[null,"NÜRNBERG","GROßREUTH H.D.VESTE",564000,3428,""]
[null,"NÜRNBERG","HÖFEN",564000,3432,""]
[null,"NÜRNBERG","HÖFLES",564000,3433,""]
[null,"NÜRNBERG","ST.JOHANNIS",564000,3434,{"$f":"+IF(A5314<>\"\",1,\"\")","v":""}]
[null,"NÜRNBERG","KATZWANG",564000,3435,""]
[null,"NÜRNBERG","KLEINREUTH H.D.VESTE",564000,3436,""]
[null,"NÜRNBERG","KLEINWEIDENMÜHLE",564000,3437,""]
[null,"NÜRNBERG","KORNBURG",564000,3438,""]
[null,"NÜRNBERG","KRAFTSHOF",564000,3439,""]
[null,"NÜRNBERG","LANGWASSER",564000,3440,""]
[null,"NÜRNBERG","LAUFAMHOLZ",564000,3441,""]
[null,"NÜRNBERG","LOHE",564000,3444,""]
[null,"NÜRNBERG","MÖGELDORF",564000,3445,""]
[null,"NÜRNBERG","MÜHLHOF",564000,3447,""]
[null,"NÜRNBERG","NEUNHOF",564000,3448,""]
[null,"NÜRNBERG","NÜRNBERG-LORENZ",564000,3449,""]
[null,"NÜRNBERG","NÜRNBERG-SEBALD",564000,3450,""]
[null,"NÜRNBERG","ST.PETER",564000,3454,""]
[null,"NÜRNBERG","REICHELSDORF",564000,3457,""]
[null,"NÜRNBERG","RENNWEG",564000,3458,""]
[null,"NÜRNBERG","RÖTHENBACH B.SCHWEINAU",564000,3461,""]
[null,"NÜRNBERG","SCHNEPFENREUTH",564000,3462,""]
[null,"NÜRNBERG","SCHNIEGLING",564000,3463,""]
[null,"NÜRNBERG","SCHOPPERSHOF",564000,3464,""]
[null,"NÜRNBERG","SCHWEINAU",564000,3468,""]
[null,"NÜRNBERG","STEINBÜHL",564000,3469,""]
[null,"NÜRNBERG","SÜNDERSBÜHL",564000,3470,""]
[null,"NÜRNBERG","TAFELHOF",564000,3471,""]
[null,"NÜRNBERG","THON",564000,3472,""]
[null,"NÜRNBERG","WETZENDORF",564000,3476,""]
[null,"NÜRNBERG","WÖHRD",564000,3478,""]
[null,"NÜRNBERG","WORZELDORF",564000,3479,""]
[null,"NÜRNBERG","ZIEGELSTEIN",564000,3480,""]
[null,"NÜRNBERG","BRUNN - NÜRNBERG",564000,3487,""]
[null,"NÜRNBERG","NÜRNBERG, GERECHTSAME",564000,3489,""]
[null,"NÜRNBERG","FORST KLEINSCHWARZENLOHE",564000,3825,""]
[null,"NÜRNBERG","FORST KLEINSCHWARZENLOHE - NBG",564000,3922,""]
[null,"NUßDORF","SONDERMONING",189130,9826,""]
[null,"NUßDORF","NUßDORF",189130,9827,""]
[null,"NUßDORF A.INN","NUßDORF A.INN",187156,9655,""]
[null,"OBER- U.UNTERWALD","KÖNIGSTEIN",371456,4451,""]
[null,"OBER- U.UNTERWALD","ACHTEL",371456,4466,""]
[null,"OBERAMMERGAU","OBERAMMERGAU",180125,9252,""]
[null,"OBERASBACH","LEICHENDORF",573122,3352,""]
[null,"OBERASBACH","OBERASBACH",573122,3353,""]
[null,"OBERAU","OBERAU",180126,9255,""]
[null,"OBERAUDORF","NIEDERAUDORF",187157,9654,""]
[null,"OBERAUDORF","OBERAUDORF",187157,9656,""]
[null,"OBERAURACH","NEUSCHLEICHACH",674159,1007,""]
[null,"OBERAURACH","OBERSCHLEICHACH",674159,1008,""]
[null,"OBERAURACH","UNTERSCHLEICHACH",674159,1009,""]
[null,"OBERAURACH","FATSCHENBRUNN",674159,1027,""]
[null,"OBERAURACH","TRETZENDORF",674159,1029,""]
[null,"OBERAURACH","TROSSENFURT",674159,1030,""]
[null,"OBERAURACH","KIRCHAICH",674159,1045,""]
[null,"OBERAURACH","DANKENFELD",674159,1046,""]
[null,"OBERBERGKIRCHEN","IRL",183132,8814,""]
[null,"OBERBERGKIRCHEN","OBERBERGKIRCHEN",183132,8815,""]
[null,"OBERDACHSTETTEN","ANFELDEN",571183,3104,""]
[null,"OBERDACHSTETTEN","MITTELDACHSTETTEN",571183,3185,""]
[null,"OBERDACHSTETTEN","OBERDACHSTETTEN",571183,3200,""]
[null,"OBERDING","OBERDING",177133,8370,""]
[null,"OBERDING","NOTZING",177133,8379,""]
[null,"OBERDOLLING","OBERDOLLING",176150,8038,""]
[null,"OBERDOLLING","UNTERDOLLING",176150,8039,""]
[null,"OBERELSBACH","GINOLFS",673149,21,""]
[null,"OBERELSBACH","OBERELSBACH",673149,22,""]
[null,"OBERELSBACH","WEISBACH",673149,31,{"$f":"+IF(A5378<>\"\",1,\"\")","v":""}]
[null,"OBERELSBACH","SONDERNAU",673149,32,""]
[null,"OBERELSBACH","UNTERELSBACH",673149,33,""]
[null,"OBERGRIESBACH","ZAHLING",771149,7351,""]
[null,"OBERGRIESBACH","OBERGRIESBACH",771149,7352,""]
[null,"OBERGÜNZBURG","WILLOFS",777154,7693,""]
[null,"OBERGÜNZBURG","BURG",777154,7694,""]
[null,"OBERGÜNZBURG","OBERGÜNZBURG",777154,7695,""]
[null,"OBERGÜNZBURG","EBERSBACH",777154,7696,""]
[null,"OBERHACHING","OBERHACHING",184134,8693,""]
[null,"OBERHACHING","OBERBIBERG",184134,8714,""]
[null,"OBERHACHING","GRÜNWALDER FORST",184134,8715,""]
[null,"OBERHACHING","DEISENHOFENER FORST-NORD",184134,8716,""]
[null,"OBERHAID","OBERHAID",471165,2241,""]
[null,"OBERHAID","STAFFELBACH",471165,2291,""]
[null,"OBERHAID","UNTERHAID",471165,2315,""]
[null,"OBERHAUSEN (LKR. ND)","UNTERHAUSEN",185150,8084,""]
[null,"OBERHAUSEN (LKR. ND)","OBERHAUSEN",185150,8085,""]
[null,"OBERHAUSEN (LKR. ND)","SINNING",185150,8086,""]
[null,"OBERHAUSEN (LKR. ND)","UNTERHAUSER FORST",185150,8090,""]
[null,"OBERHAUSEN (LKR. WM)","OBERHAUSEN",190135,9224,""]
[null,"OBERICKELSHEIM","GEIßLINGEN",575155,2955,""]
[null,"OBERICKELSHEIM","OBERICKELSHEIM",575155,3007,""]
[null,"OBERICKELSHEIM","RODHEIM",575155,3023,""]
[null,"OBERKOTZAU","FATTIGAU",475158,1963,""]
[null,"OBERKOTZAU","AUTENGRÜN",475158,1964,""]
[null,"OBERKOTZAU","OBERKOTZAU",475158,1965,""]
[null,"OBERLEICHTERSBACH","BREITENBACH",672138,175,""]
[null,"OBERLEICHTERSBACH","MITGENFELD",672138,176,""]
[null,"OBERLEICHTERSBACH","OBERLEICHTERSBACH",672138,183,""]
[null,"OBERLEICHTERSBACH","FORST DETTER-NORD",672138,196,""]
[null,"OBERLEICHTERSBACH","MODLOS",672138,197,""]
[null,"OBERLEICHTERSBACH","UNTERLEICHTERSBACH",672138,198,""]
[null,"OBERMAISELSTEIN","OBERMAISELSTEIN",780131,7986,""]
[null,"OBERMEITINGEN","OBERMEITINGEN",181131,9042,""]
[null,"OBERMICHELBACH","OBERMICHELBACH",573123,3333,""]
[null,"OBERNBREIT","OBERNBREIT",675156,1218,""]
[null,"OBERNBURG A.MAIN","EISENBACH",676145,414,""]
[null,"OBERNBURG A.MAIN","OBERNBURG A.MAIN",676145,415,""]
[null,"OBERNDORF A.LECH","EGGELSTETTEN",779196,6979,""]
[null,"OBERNDORF A.LECH","OBERNDORF A.LECH",779196,6980,""]
[null,"OBERNEUKIRCHEN","OBERNEUKIRCHEN",183134,8853,""]
[null,"OBERNZELL","KELLBERG",275137,6332,""]
[null,"OBERNZELL","EDERLSDORF",275137,6346,""]
[null,"OBERNZELL","OBERNZELL",275137,6347,""]
[null,"OBERNZENN","EGENHAUSEN",575156,2936,""]
[null,"OBERNZENN","OBERALTENBERNHEIM",575156,3005,""]
[null,"OBERNZENN","OBERNZENN",575156,3011,""]
[null,"OBERNZENN","UNTERALTENBERNHEIM",575156,3047,""]
[null,"OBERNZENN","UNTERNZENN",575156,3050,""]
[null,"OBERNZENN","URPHERTSHOFEN",575156,3052,""]
[null,"OBEROSTENDORF","GUTENBERG",777155,7852,""]
[null,"OBEROSTENDORF","UNTEROSTENDORF",777155,7853,""]
[null,"OBEROSTENDORF","OBEROSTENDORF",777155,7854,""]
[null,"OBEROSTENDORF","LENGENFELD",777155,7855,""]
[null,"OBEROTTMARSHAUSEN","OBEROTTMARSHAUSEN",772186,7323,""]
[null,"OBERPFRAMMERN","OBERPFRAMMERN",175131,8770,""]
[null,"OBERPLEICHFELD","OBERPLEICHFELD",679169,679,""]
[null,"OBERPÖRING","NIEDERPÖRING",271139,5958,""]
[null,"OBERPÖRING","OBERPÖRING",271139,5959,""]
[null,"OBERREICHENBACH","OBERREICHENBACH",572147,2825,""]
[null,"OBERREUTE","OBERREUTE",776121,7963,""]
[null,"OBERRIEDEN","UNTERRIEDEN",778183,7760,""]
[null,"OBERRIEDEN","OBERRIEDEN",778183,7761,""]
[null,"OBERROGGENBURGER WALD","OBERROGGENBURGER WALD",775452,7103,{"$f":"+IF(A5442<>\"\",1,\"\")","v":""}]
[null,"OBERROTH","OBERROTH",775141,7522,""]
[null,"OBERROTH","HERRENSTETTEN",775141,7523,""]
[null,"OBERSCHEINFELD","HERPER",575157,1173,""]
[null,"OBERSCHEINFELD","MANNHOFER FORST",575157,1190,""]
[null,"OBERSCHEINFELD","STIERHÖFSTETTEN",575157,1191,""]
[null,"OBERSCHEINFELD","KRETTENBACH",575157,1192,""]
[null,"OBERSCHEINFELD","OBERSCHEINFELD",575157,1193,""]
[null,"OBERSCHEINFELD","PRÜHL",575157,1194,""]
[null,"OBERSCHEINFELD","APPENFELDEN",575157,1195,""]
[null,"OBERSCHEINFELD","SCHÖNAICH",575157,1210,""]
[null,"OBERSCHEINFELD","HERPERSDORF",575157,1211,""]
[null,"OBERSCHLEIßHEIM","OBERSCHLEIßHEIM",184135,8695,""]
[null,"OBERSCHNEIDING","OBERPIEBING",278167,5655,""]
[null,"OBERSCHNEIDING","WOLFERKOFEN",278167,5656,""]
[null,"OBERSCHNEIDING","NIEDERSCHNEIDING",278167,5657,""]
[null,"OBERSCHNEIDING","OBERSCHNEIDING",278167,5668,""]
[null,"OBERSCHNEIDING","GRAFLING",278167,5669,""]
[null,"OBERSCHNEIDING","REIßING",278167,5673,""]
[null,"OBERSCHNEIDING","GROßENPINNING",278167,5674,""]
[null,"OBERSCHÖNEGG","WEINRIED",778184,7542,""]
[null,"OBERSCHÖNEGG","OBERSCHÖNEGG",778184,7543,""]
[null,"OBERSCHÖNEGG","DIETERSHOFEN B.BABENHAUSEN",778184,7544,""]
[null,"OBERSCHWARZACH","WIEBELSBERG",678164,1048,""]
[null,"OBERSCHWARZACH","MUTZENROTH",678164,1057,""]
[null,"OBERSCHWARZACH","OBERSCHWARZACH",678164,1058,""]
[null,"OBERSCHWARZACH","HANDTHAL",678164,1059,""]
[null,"OBERSCHWARZACH","BREITBACH",678164,1062,""]
[null,"OBERSCHWARZACH","SIEGENDORF",678164,1063,""]
[null,"OBERSCHWEINBACH","OBERSCHWEINBACH",179140,8468,""]
[null,"OBERSCHWEINBACH","GÜNZLHOFEN",179140,8469,""]
[null,"OBERSINN","BURGJOß",677169,501,""]
[null,"OBERSINN","OBERSINN",677169,502,""]
[null,"OBERSINN","FORST AURA",677169,503,""]
[null,"OBERSÖCHERING","OBERSÖCHERING",190136,9229,""]
[null,"OBERSTAUFEN","OBERSTAUFEN",780132,7964,""]
[null,"OBERSTAUFEN","AACH I.ALLGÄU",780132,7965,""]
[null,"OBERSTAUFEN","THALKIRCHDORF",780132,7966,""]
[null,"OBERSTDORF","SCHÖLLANG",780133,7988,""]
[null,"OBERSTDORF","TIEFENBACH B.OBERSTDORF",780133,7989,""]
[null,"OBERSTDORF","OBERSTDORF",780133,7990,""]
[null,"OBERSTREU","OBERSTREU",673151,46,""]
[null,"OBERSTREU","MITTELSTREU",673151,53,""]
[null,"OBERSÜßBACH","MARTINSZELL",274165,6579,""]
[null,"OBERSÜßBACH","OBERSÜßBACH",274165,6580,""]
[null,"OBERSÜßBACH","OBERMÜNCHEN",274165,6581,""]
[null,"OBERTAUFKIRCHEN","OBERORNAU",183135,8829,""]
[null,"OBERTAUFKIRCHEN","OBERTAUFKIRCHEN",183135,8830,""]
[null,"OBERTHULBA","HASSENBACH",672139,230,""]
[null,"OBERTHULBA","NEUWIRTSHAUSER FORST",672139,236,""]
[null,"OBERTHULBA","SCHLIMPFHOF",672139,237,""]
[null,"OBERTHULBA","OBERTHULBA",672139,244,""]
[null,"OBERTHULBA","HETZLOS",672139,250,""]
[null,"OBERTHULBA","FRANKENBRUNN",672139,251,""]
[null,"OBERTHULBA","REITH",672139,252,""]
[null,"OBERTHULBA","THULBA",672139,257,""]
[null,"OBERTHULBA","WITTERSHAUSEN",672139,258,""]
[null,"OBERTRAUBLING","GEBELKOFEN",375179,5237,""]
[null,"OBERTRAUBLING","NEUDORF",375179,5288,""]
[null,"OBERTRAUBLING","NIEDERTRAUBLING",375179,5291,""]
[null,"OBERTRAUBLING","OBERHINKOFEN",375179,5294,""]
[null,"OBERTRAUBLING","OBERTRAUBLING",375179,5296,""]
[null,"OBERTRUBACH","KLEINGESEE",474156,2645,""]
[null,"OBERTRUBACH","GESCHWAND",474156,2670,""]
[null,"OBERTRUBACH","WOLFSBERG",474156,2671,{"$f":"+IF(A5506<>\"\",1,\"\")","v":""}]
[null,"OBERTRUBACH","OBERTRUBACH",474156,2672,""]
[null,"OBERVIECHTACH","NUNZENRIED",376151,4831,""]
[null,"OBERVIECHTACH","MITTERLANGAU",376151,4835,""]
[null,"OBERVIECHTACH","WILDEPPENRIED",376151,4836,""]
[null,"OBERVIECHTACH","PULLENRIED",376151,4837,""]
[null,"OBERVIECHTACH","PIRKHOF",376151,4838,""]
[null,"OBERVIECHTACH","HOF",376151,4839,""]
[null,"OBERVIECHTACH","OBERVIECHTACH",376151,4840,""]
[null,"OBERVIECHTACH","LIND",376151,4841,""]
[null,"OBERVIECHTACH","OBERMURACH",376151,4842,""]
[null,"OBERVIECHTACH","EIGELSBERG",376151,4843,""]
[null,"OBING","ALBERTAICH",189133,9810,""]
[null,"OBING","OBING",189133,9811,""]
[null,"OCHSENFURT","ERLACH",679170,729,""]
[null,"OCHSENFURT","DARSTADT",679170,736,""]
[null,"OCHSENFURT","GOßMANNSDORF A.MAIN",679170,737,""]
[null,"OCHSENFURT","KLEINOCHSENFURT",679170,738,""]
[null,"OCHSENFURT","ZEUBELRIED",679170,739,""]
[null,"OCHSENFURT","TÜCKELHAUSEN",679170,742,""]
[null,"OCHSENFURT","HOHESTADT",679170,743,""]
[null,"OCHSENFURT","OCHSENFURT",679170,744,""]
[null,"OCHSENFURT","HOPFERSTADT",679170,752,""]
[null,"ODELZHAUSEN","HÖFA",174135,8568,""]
[null,"ODELZHAUSEN","SITTENBACH",174135,8570,""]
[null,"ODELZHAUSEN","EBERTSHAUSEN",174135,8613,""]
[null,"ODELZHAUSEN","ODELZHAUSEN",174135,8634,""]
[null,"ODELZHAUSEN","TAXA",174135,8648,""]
[null,"OERLENBACH","ELTINGSHAUSEN",672140,269,""]
[null,"OERLENBACH","ROTTERSHAUSEN",672140,270,""]
[null,"OERLENBACH","OERLENBACH",672140,283,""]
[null,"OERLENBACH","EBENHAUSEN",672140,290,""]
[null,"OETTINGEN I.BAYERN","ERLBACH",779197,6713,""]
[null,"OETTINGEN I.BAYERN","NIEDERHOFEN",779197,6714,""]
[null,"OETTINGEN I.BAYERN","LEHMINGEN",779197,6715,""]
[null,"OETTINGEN I.BAYERN","OETTINGEN I.BAY.",779197,6716,""]
[null,"OETTINGEN I.BAYERN","NITTINGEN",779197,6717,""]
[null,"OETTINGEN I.BAYERN","HEUBERG",779197,6718,""]
[null,"OFFENBERG","PENZENRIED",271140,5908,""]
[null,"OFFENBERG","BUCHBERG",271140,5909,""]
[null,"OFFENBERG","OFFENBERG",271140,5910,""]
[null,"OFFENHAUSEN","BREITENBRUNN",574145,3511,""]
[null,"OFFENHAUSEN","KUCHA",574145,3549,""]
[null,"OFFENHAUSEN","OFFENHAUSEN",574145,3557,""]
[null,"OFFENHAUSEN","PÜSCHELDORF",574145,3587,""]
[null,"OFFINGEN","OFFINGEN",774171,7114,""]
[null,"OFFINGEN","SCHNUTTENBACH",774171,7115,""]
[null,"OFTERSCHWANG","OFTERSCHWANG",780134,7983,""]
[null,"OHLSTADT","OHLSTADT",180127,9248,""]
[null,"OHRENBACH","HABELSEE",571188,2962,""]
[null,"OHRENBACH","OBERSCHECKENBACH",571188,3014,""]
[null,"OHRENBACH","OHRENBACH",571188,3016,""]
[null,"OLCHING","OLCHING",179142,8461,""]
[null,"OLCHING","ESTING",179142,8462,""]
[null,"OLCHING","GEISELBULLACH",179142,8463,""]
[null,"OMERZ U.ROTER BERG","VÖLKERSLEIER",672463,248,""]
[null,"OPFENBACH","OPFENBACH",776122,7946,""]
[null,"ORNBAU","GERN",571189,3144,""]
[null,"ORNBAU","ORNBAU",571189,3204,""]
[null,"ORTENBURG","IGLBACH",275138,6272,""]
[null,"ORTENBURG","SÖLDENAU",275138,6273,""]
[null,"ORTENBURG","ORTENBURG",275138,6274,""]
[null,"ORTENBURG","KÖNIGBACH",275138,6275,""]
[null,"ORTENBURG","DORFBACH",275138,6276,""]
[null,"OSING","HERBOLZHEIM",575451,2971,{"$f":"+IF(A5570<>\"\",1,\"\")","v":""}]
[null,"OSTERBERG","WEILER",775142,7527,""]
[null,"OSTERBERG","OSTERBERG",775142,7528,""]
[null,"OSTERHOFEN","AICHA A.D.DONAU",271141,5963,""]
[null,"OSTERHOFEN","NIEDERMÜNCHSDORF",271141,5964,""]
[null,"OSTERHOFEN","OSTERHOFEN",271141,5965,""]
[null,"OSTERHOFEN","WISSELSING",271141,5966,""]
[null,"OSTERHOFEN","ALTENMARKT",271141,5967,""]
[null,"OSTERHOFEN","KIRCHDORF B.OSTERHOFEN",271141,5968,""]
[null,"OSTERHOFEN","ANNING",271141,5969,""]
[null,"OSTERHOFEN","LANGENAMMING",271141,5970,""]
[null,"OSTERHOFEN","GÖTTERSDORF",271141,5971,""]
[null,"OSTERHOFEN","GERGWEIS",271141,5972,""]
[null,"OSTERHOFEN","GALGWEIS",271141,5973,""]
[null,"OSTERHOFEN","OBERNDORF",271141,5976,""]
[null,"OSTERZELL","OSTERZELL",777157,7865,""]
[null,"OSTHEIM V.D.RHÖN","ALTENFELD",673153,16,""]
[null,"OSTHEIM V.D.RHÖN","Forst Ostheim v.d.Rhön",673153,19,""]
[null,"OSTHEIM V.D.RHÖN","URSPRINGEN",673153,23,""]
[null,"OSTHEIM V.D.RHÖN","OSTHEIM V.D.RHÖN",673153,25,""]
[null,"OSTHEIM V.D.RHÖN","OBERWALDBEHRUNGEN",673153,34,""]
[null,"ÖSTL.NEUBÄUER FORST","NEUBÄUER FORST",376454,4977,""]
[null,"ÖSTL.NEUBÄUER FORST","NEUBÄU",376454,5073,""]
[null,"OTTENHOFEN","OTTENHOFEN",177134,8398,""]
[null,"OTTENSOOS","OTTENSOOS",574146,3559,""]
[null,"OTTENSOOS","WEIGENHOFEN",574146,3584,""]
[null,"OTTERFING","OTTERFING",182127,9501,""]
[null,"OTTING","OTTING",779198,6904,""]
[null,"OTTOBEUREN","LACHEN",778186,7580,""]
[null,"OTTOBEUREN","HAITZEN",778186,7583,""]
[null,"OTTOBEUREN","OTTOBEUREN",778186,7584,""]
[null,"OTTOBEUREN","GUGGENBERG",778186,7585,""]
[null,"OTTOBEUREN","BETZISRIED",778186,7586,""]
[null,"OTTOBEUREN","OLLARZRIED",778186,7587,""]
[null,"OTTOBRUNN","UNTERHACHING",184136,8710,""]
[null,"OTZING","OTZING",271143,5955,""]
[null,"OTZING","HAUNERSDORF",271143,5956,""]
[null,"OTZING","LAILLING",271143,5957,""]
[null,"OY-MITTELBERG","PETERSTHAL",780128,7687,""]
[null,"OY-MITTELBERG","MITTELBERG",780128,7688,""]
[null,"PÄHL","FISCHEN A.AMMERSEE",190138,9201,""]
[null,"PÄHL","PÄHL",190138,9202,""]
[null,"PAINTEN","KLINGEN",273159,5487,""]
[null,"PAINTEN","NEULOHE",273159,5518,""]
[null,"PAINTEN","PAINTEN",273159,5519,""]
[null,"PAINTEN","ROTHENBÜGL",273159,5520,""]
[null,"PAINTEN","PAINTNER FORST",273159,5521,""]
[null,"PAINTEN","KLINGEN - PAINTEN",273159,5522,""]
[null,"PAINTNER FORST","PAINTNER FORST",273455,5521,""]
[null,"PALLING","KIRCHBERG",189134,9901,""]
[null,"PALLING","PALLING",189134,9902,""]
[null,"PALLING","FREUTSMOOS",189134,9903,""]
[null,"PAPPENHEIM","OSTERDORF",577158,3756,""]
[null,"PAPPENHEIM","GEISLOHE",577158,3757,""]
[null,"PAPPENHEIM","NEUDORF",577158,3758,""]
[null,"PAPPENHEIM","PAPPENHEIM",577158,3759,""]
[null,"PAPPENHEIM","GÖHREN",577158,3760,""]
[null,"PAPPENHEIM","BIESWANG",577158,3761,""]
[null,"PAPPENHEIM","ÜBERMATZHOFEN",577158,3762,""]
[null,"PAPPENHEIM","ZIMMERN",577158,3763,""]
[null,"PAPPENHEIM","OCHSENHART",577158,3764,""]
[null,"PARKSTEIN","SCHWAND",374144,4306,""]
[null,"PARKSTEIN","OED",374144,4307,""]
[null,"PARKSTEIN","HAMMERLES",374144,4308,""]
[null,"PARKSTEIN","PARKSTEIN",374144,4309,{"$f":"+IF(A5634<>\"\",1,\"\")","v":""}]
[null,"PARKSTEIN","SCHWARZENBACH",374144,4351,""]
[null,"PARKSTEIN","MANTELER FORST",374144,4352,""]
[null,"PARKSTEIN","MEERBODENREUTH",374144,4353,""]
[null,"PARKSTETTEN","PARKSTETTEN",278170,5607,""]
[null,"PARKSTETTEN","REIBERSDORF",278170,5613,""]
[null,"PARSBERG","HÖRMANNSDORF",373151,5408,""]
[null,"PARSBERG","RUDENSHOFEN",373151,5409,""]
[null,"PARSBERG","DARSHOFEN",373151,5410,""]
[null,"PARSBERG","PARSBERG",373151,5411,""]
[null,"PARSBERG","WILLENHOFEN",373151,5412,""]
[null,"PARSBERG","HERRNRIED",373151,5413,""]
[null,"PARSBERG","DEGERNDORF",373151,5414,""]
[null,"PARSBERG","SEE",373151,5416,""]
[null,"PARSBERG","GROßBISSENDORF",373151,5417,""]
[null,"PARTENSTEIN","PARTENSTEINER FORST",677170,536,""]
[null,"PARTENSTEIN","PARTENSTEIN",677170,537,""]
[null,"PARTENSTEINER FORST","PARTENSTEINER FORST",677461,536,""]
[null,"PASSAU","KIRCHBERG",262000,6326,""]
[null,"PASSAU","HEINING",262000,6348,""]
[null,"PASSAU","HACKLBERG",262000,6349,""]
[null,"PASSAU","RIES",262000,6350,""]
[null,"PASSAU","HALS",262000,6351,""]
[null,"PASSAU","GRUBWEG",262000,6352,""]
[null,"PASSAU","PASSAU",262000,6353,""]
[null,"PASSAU","HAIDENHOF",262000,6354,""]
[null,"PASSAU","ST.NIKOLA",262000,6355,""]
[null,"PASSAU","BEIDERWIES",262000,6356,""]
[null,"PASSAU","ALTSTADT",262000,6390,""]
[null,"PASSAU","ILZSTADT",262000,6391,""]
[null,"PASSAU","INNSTADT",262000,6392,""]
[null,"PASSAU","NEUMARKT",262000,6393,""]
[null,"PASTETTEN","PASTETTEN",177135,8399,""]
[null,"PATERSDORF","PATERSDORF",276134,5736,""]
[null,"PAUNZHAUSEN","PAUNZHAUSEN",178150,8298,""]
[null,"PAUNZHAUSEN","JOHANNECK",178150,8299,""]
[null,"PECHBRUNN","GROSCHLATTENGRÜN",377145,4115,""]
[null,"PECHBRUNN","PECHBRUNN",377145,4116,""]
[null,"PEGNITZ","ELBERSBERG",472175,2530,""]
[null,"PEGNITZ","TROCKAU",472175,2536,""]
[null,"PEGNITZ","LEUPS",472175,2537,""]
[null,"PEGNITZ","BÜCHENBACH",472175,2538,""]
[null,"PEGNITZ","BUCHAU",472175,2539,""]
[null,"PEGNITZ","ZIPS",472175,2540,""]
[null,"PEGNITZ","KÖRBELDORF",472175,2541,""]
[null,"PEGNITZ","TROSCHENREUTH",472175,2542,""]
[null,"PEGNITZ","PEGNITZ",472175,2543,""]
[null,"PEGNITZ","HAINBRONN",472175,2544,""]
[null,"PEGNITZ","PENZENREUTH",472175,2545,""]
[null,"PEGNITZ","BRONN",472175,2546,""]
[null,"PEGNITZ","VELDENSTEINERFORST",472175,2556,""]
[null,"PEGNITZ","PEGNITZ, BERGWERKE",472175,2560,""]
[null,"PEIßENBERG","PEIßENBERG",190139,9217,""]
[null,"PEIßENBERG","AMMERHÖFE",190139,9218,""]
[null,"PEITING","BIRKLAND",190140,9084,""]
[null,"PEITING","PEITING",190140,9092,""]
[null,"PEMFLING","GRAFENKIRCHEN",372146,5037,""]
[null,"PEMFLING","ENGELSDORF",372146,5038,""]
[null,"PEMFLING","KAGER",372146,5039,""]
[null,"PEMFLING","PEMFLING",372146,5040,""]
[null,"PEMFLING","PITZLING",372146,5041,""]
[null,"PEMFLING","RHANWALTING",372146,5045,""]
[null,"PENTLING","DECHBETTEN",375180,5218,""]
[null,"PENTLING","GRAßLFING",375180,5244,""]
[null,"PENTLING","GROßBERG",375180,5246,{"$f":"+IF(A5698<>\"\",1,\"\")","v":""}]
[null,"PENTLING","HOHENGEBRACHING",375180,5264,""]
[null,"PENTLING","MATTING",375180,5284,""]
[null,"PENTLING","NEUDORF",375180,5288,""]
[null,"PENTLING","OBERISLING",375180,5295,""]
[null,"PENTLING","PENTLING",375180,5297,""]
[null,"PENTLING","POIGN",375180,5308,""]
[null,"PENTLING","ZIEGETSDORF",375180,5359,""]
[null,"PENZBERG","PENZBERG",190141,9232,""]
[null,"PENZING","EPFENHAUSEN",181132,9016,""]
[null,"PENZING","OBERBERGEN",181132,9038,""]
[null,"PENZING","PENZING",181132,9046,""]
[null,"PENZING","RAMSACH",181132,9053,""]
[null,"PENZING","UNTERMÜHLHAUSEN",181132,9071,""]
[null,"PERACH","PERACH",171126,8929,""]
[null,"PERASDORF","PERASDORF",278171,5600,""]
[null,"PERKAM","PERKAM",278172,5619,""]
[null,"PERLACHER FORST","PERLACHER FORST",184457,8720,""]
[null,"PERLESREUT","HAUS I.WALD",272138,5841,""]
[null,"PERLESREUT","HEINRICHSREIT",272138,5842,""]
[null,"PERLESREUT","KUMREUT",272138,5844,""]
[null,"PERLESREUT","WALDENREUT",272138,5858,""]
[null,"PERLESREUT","PERLESREUT",272138,5859,""]
[null,"PERLESREUT","NIEDERPERLESREUT",272138,5860,""]
[null,"PERLESREUT","PRAßREUT",272138,5861,""]
[null,"PETERSAURACH","ALTENDETTELSAU",571190,3103,""]
[null,"PETERSAURACH","GROßHASLACH",571190,3149,""]
[null,"PETERSAURACH","HERPERSDORF",571190,3158,""]
[null,"PETERSAURACH","PETERSAURACH",571190,3205,""]
[null,"PETERSAURACH","VESTENBERG",571190,3230,""]
[null,"PETERSDORF","WILLPRECHTSZELL",771155,7415,""]
[null,"PETERSDORF","SCHÖNLEITEN",771155,7416,""]
[null,"PETERSDORF","ALSMOOS",771155,7420,""]
[null,"PETERSDORF","PETERSDORF",771155,7421,""]
[null,"PETERSHAUSEN","ASBACH",174136,8605,""]
[null,"PETERSHAUSEN","KOLLBACH",174136,8625,""]
[null,"PETERSHAUSEN","OBERMARBACH",174136,8632,""]
[null,"PETERSHAUSEN","PETERSHAUSEN",174136,8637,""]
[null,"PETTENDORF","KNEITING",375181,5272,""]
[null,"PETTENDORF","PETTENDORF",375181,5298,""]
[null,"PETTING","PETTING",189135,9916,""]
[null,"PETTING","RINGHAM",189135,9917,""]
[null,"PETTING","SCHÖNRAMER FILZ",189135,9918,""]
[null,"PETTSTADT","PETTSTADT",471169,2250,""]
[null,"PFAFFENHAUSEN","SCHÖNEBERG",778187,7756,""]
[null,"PFAFFENHAUSEN","WEILBACH",778187,7757,""]
[null,"PFAFFENHAUSEN","PFAFFENHAUSEN",778187,7758,""]
[null,"PFAFFENHAUSEN","EGELHOFEN",778187,7759,""]
[null,"PFAFFENHOFEN A.D.GLONN","PFAFFENHOFEN A.D.GLONN",174137,8569,""]
[null,"PFAFFENHOFEN A.D.GLONN","UNTERUMBACH",174137,8571,""]
[null,"PFAFFENHOFEN A.D.GLONN","WEITENRIED",174137,8572,""]
[null,"PFAFFENHOFEN A.D.ILM","TEGERNBACH",186143,8195,""]
[null,"PFAFFENHOFEN A.D.ILM","SULZBACH",186143,8196,""]
[null,"PFAFFENHOFEN A.D.ILM","EHRENBERG",186143,8197,""]
[null,"PFAFFENHOFEN A.D.ILM","ANGKOFEN",186143,8198,""]
[null,"PFAFFENHOFEN A.D.ILM","GUNDAMSRIED",186143,8199,""]
[null,"PFAFFENHOFEN A.D.ILM","HAIMPERTSHOFEN",186143,8200,""]
[null,"PFAFFENHOFEN A.D.ILM","PFAFFENHOFEN A.D.ILM",186143,8201,""]
[null,"PFAFFENHOFEN A.D.ILM","NIEDERSCHEYERN",186143,8202,""]
[null,"PFAFFENHOFEN A.D.ILM","AFFALTERBACH",186143,8203,""]
[null,"PFAFFENHOFEN A.D.ILM","WALKERSBACH",186143,8204,""]
[null,"PFAFFENHOFEN A.D.ILM","UTTENHOFEN",186143,8205,""]
[null,"PFAFFENHOFEN A.D.ILM","FÖRNBACH",186143,8206,""]
[null,"PFAFFENHOFEN A.D.ILM","EBERSTETTEN",186143,8207,""]
[null,"PFAFFENHOFEN A.D.ROTH","KADELTSHOFEN",775143,7070,{"$f":"+IF(A5762<>\"\",1,\"\")","v":""}]
[null,"PFAFFENHOFEN A.D.ROTH","RAUNERTSHOFEN",775143,7071,""]
[null,"PFAFFENHOFEN A.D.ROTH","ROTH",775143,7072,""]
[null,"PFAFFENHOFEN A.D.ROTH","BERG",775143,7073,""]
[null,"PFAFFENHOFEN A.D.ROTH","PFAFFENHOFEN A.D.ROTH",775143,7074,""]
[null,"PFAFFENHOFEN A.D.ROTH","BEUREN",775143,7075,""]
[null,"PFAFFENHOFEN A.D.ROTH","BALMERTSHOFEN",775143,7076,""]
[null,"PFAFFENHOFEN A.D.ROTH","VOLKERTSHOFEN",775143,7077,""]
[null,"PFAFFENHOFEN A.D.ROTH","NIEDERHAUSEN",775143,7078,""]
[null,"PFAFFENHOFEN A.D.ROTH","BIBERBERG",775143,7079,""]
[null,"PFAFFENHOFEN A.D.ROTH","ERBISHOFEN",775143,7080,""]
[null,"PFAFFING","PFAFFING",187159,9736,""]
[null,"PFAFFING","SPRINGLBACH",187159,9738,""]
[null,"PFAFFING","RETTENBACH",187159,9740,""]
[null,"PFAFFING","FARRACH",187159,9742,""]
[null,"PFAKOFEN","PFAKOFEN",375182,5302,""]
[null,"PFAKOFEN","PFELLKOFEN",375182,5304,""]
[null,"PFAKOFEN","ROGGING",375182,5318,""]
[null,"PFARRKIRCHEN","PFARRKIRCHEN",277138,6450,""]
[null,"PFARRKIRCHEN","REICHENBERG",277138,6454,""]
[null,"PFARRKIRCHEN","UNTERGRASENSEE",277138,6473,""]
[null,"PFARRKIRCHEN","WALDHOF",277138,6479,""]
[null,"PFARRWEISACH","JUNKERSDORF A.D.WEISACH",674184,2198,""]
[null,"PFARRWEISACH","KRAISDORF",674184,2206,""]
[null,"PFARRWEISACH","LICHTENSTEIN",674184,2212,""]
[null,"PFARRWEISACH","LOHR",674184,2218,""]
[null,"PFARRWEISACH","PFARRWEISACH",674184,2253,""]
[null,"PFARRWEISACH","RABELSDORF",674184,2259,""]
[null,"PFATTER","GEISLING",375183,5238,""]
[null,"PFATTER","GMÜND",375183,5240,""]
[null,"PFATTER","GRIESAU",375183,5245,""]
[null,"PFATTER","PFATTER",375183,5303,""]
[null,"PFEFFENHAUSEN","NIEDERHATZKOFEN",274172,6555,""]
[null,"PFEFFENHAUSEN","OBERLAUTERBACH",274172,6560,""]
[null,"PFEFFENHAUSEN","NIEDERHORNBACH",274172,6561,""]
[null,"PFEFFENHAUSEN","RAINERTSHAUSEN",274172,6562,""]
[null,"PFEFFENHAUSEN","PFEFFENHAUSEN",274172,6563,""]
[null,"PFEFFENHAUSEN","STOLLNRIED",274172,6564,""]
[null,"PFEFFENHAUSEN","SCHMATZHAUSEN",274172,6565,""]
[null,"PFOFELD","PFOFELD",577159,3623,""]
[null,"PFOFELD","THANNHAUSEN",577159,3624,""]
[null,"PFÖRRING","LOBSING",176153,8040,""]
[null,"PFÖRRING","FORCHHEIM",176153,8041,""]
[null,"PFÖRRING","ETTLING",176153,8042,""]
[null,"PFÖRRING","PFÖRRING",176153,8043,""]
[null,"PFÖRRING","WACKERSTEIN",176153,8044,""]
[null,"PFÖRRING","GADEN B.PFÖRRING",176153,8045,""]
[null,"PFORZEN","INGENRIED",777158,7843,""]
[null,"PFORZEN","PFORZEN",777158,7844,""]
[null,"PFREIMD","SALTENDORF",376153,4807,""]
[null,"PFREIMD","WEIHERN",376153,4811,""]
[null,"PFREIMD","IFFELSDORF",376153,4812,""]
[null,"PFREIMD","STEIN",376153,4813,""]
[null,"PFREIMD","HOHENTRESWITZ",376153,4814,""]
[null,"PFREIMD","FUCHSENDORF",376153,4815,""]
[null,"PFREIMD","PFREIMD",376153,4816,""]
[null,"PFREIMD","PAMSENDORF",376153,4817,""]
[null,"PFRONTEN","BERGPFRONTEN",777159,7910,""]
[null,"PFRONTEN","STEINACHPFRONTEN",777159,7911,""]
[null,"PHILIPPSREUT","ANNATHAL",272139,5810,""]
[null,"PHILIPPSREUT","PHILIPPSREUT",272139,5821,""]
[null,"PHILIPPSREUTER WALD","PHILIPPSREUT",272457,5821,""]
[null,"PIDING","PIDING",172128,9941,""]
[null,"PIELENHOFEN","PIELENHOFEN",375184,5305,""]
[null,"PIELENHOFEN","PIELENHOFER WALD L.D.NAAB",375184,5306,{"$f":"+IF(A5826<>\"\",1,\"\")","v":""}]
[null,"PIELENHOFER WALD L.D.NAAB","PIELENHOFER WALD L.D.NAAB",375453,5306,""]
[null,"PIELENHOFER WALD R.D.NAAB","PIELENHOFER WALD R.D.NAAB",375454,5476,""]
[null,"PILSACH","DIETKIRCHEN",373153,4613,""]
[null,"PILSACH","LAABER",373153,4638,""]
[null,"PILSACH","LITZLOHE",373153,4645,""]
[null,"PILSACH","OBERWIESENACKER",373153,4661,""]
[null,"PILSACH","PFEFFERTSHOFEN",373153,4666,""]
[null,"PILSACH","PILSACH",373153,4667,""]
[null,"PILSTING","GANACKER",279132,6196,""]
[null,"PILSTING","GROßKÖLLNBACH",279132,6197,""]
[null,"PILSTING","HARBURG",279132,6198,""]
[null,"PILSTING","PILSTING",279132,6199,""]
[null,"PILSTING","WAIBLING",279132,6200,""]
[null,"PINZBERG","GOSBERG",474158,2680,""]
[null,"PINZBERG","PINZBERG",474158,2681,""]
[null,"PINZBERG","DOBENREUTH",474158,2682,""]
[null,"PIRK","ENGLESHOF",374146,4395,""]
[null,"PIRK","PIRK",374146,4402,""]
[null,"PIRK","ENZENRIETH",374146,4403,""]
[null,"PITTENHART","PITTENHART",189137,9813,""]
[null,"PLANEGG","PLANEGG",184138,8699,""]
[null,"PLANKENFELS","SCHÖNFELD",472176,2397,""]
[null,"PLANKENFELS","SCHRESSENDORF",472176,2406,""]
[null,"PLANKENFELS","PLANKENFELS",472176,2407,""]
[null,"PLATTLING","PANKOFEN",271146,5932,""]
[null,"PLATTLING","PLATTLING",271146,5933,""]
[null,"PLATTLING","PIELWEICHS",271146,5934,""]
[null,"PLECH","OTTENHOF",472177,2554,""]
[null,"PLECH","PLECH",472177,2555,""]
[null,"PLECKENSTEINER WALD","NEUREICHENAU",272458,5869,""]
[null,"PLEINFELD","ALLMANNSDORF",577161,3701,""]
[null,"PLEINFELD","STIRN",577161,3702,""]
[null,"PLEINFELD","RAMSBERG AM BROMBACHSEE",577161,3703,""]
[null,"PLEINFELD","DORSBRUNN",577161,3704,""]
[null,"PLEINFELD","SANKT VEIT",577161,3705,""]
[null,"PLEINFELD","PLEINFELD",577161,3706,""]
[null,"PLEINFELD","MISCHELBACH",577161,3707,""]
[null,"PLEINFELD","MANNHOLZ",577161,3708,""]
[null,"PLEINFELD","WALTING",577161,3709,""]
[null,"PLEISKIRCHEN","EGGEN",171127,8907,""]
[null,"PLEISKIRCHEN","NONNBERG",171127,8924,""]
[null,"PLEISKIRCHEN","OBERPLEISKIRCHEN",171127,8927,""]
[null,"PLEISKIRCHEN","UNTERPLEISKIRCHEN",171127,8942,""]
[null,"PLEISKIRCHEN","WALD B.WINHÖRING",171127,8944,""]
[null,"PLEß","PLEß",778188,7549,""]
[null,"PLEYSTEIN","BERNRIETH",374147,4337,""]
[null,"PLEYSTEIN","REINHARDSRIETH",374147,4343,""]
[null,"PLEYSTEIN","MIESBRUNN",374147,4344,""]
[null,"PLEYSTEIN","PLEYSTEIN",374147,4345,""]
[null,"PLEYSTEIN","LOHMA",374147,4346,""]
[null,"PLEYSTEIN","BURKHARDSRIETH",374147,4347,""]
[null,"PLEYSTEIN","WAIDHAUS",374147,4348,""]
[null,"PLIENING","GELTING",175133,8760,""]
[null,"PLIENING","PLIENING",175133,8773,""]
[null,"PLÖßBERG","LENGENFELD B.TIRSCHENREUTH",377146,4151,""]
[null,"PLÖßBERG","HOHENTHAN",377146,4159,""]
[null,"PLÖßBERG","LIEBENSTEIN",377146,4161,""]
[null,"PLÖßBERG","BETZENMÜHLE",377146,4162,""]
[null,"PLÖßBERG","SCHÖNFICHT",377146,4163,""]
[null,"PLÖßBERG","BEIDL",377146,4164,""]
[null,"PLÖßBERG","SCHÖNKIRCH",377146,4165,""]
[null,"PLÖßBERG","WILDENAU",377146,4166,""]
[null,"PLÖßBERG","PLÖßBERG",377146,4167,""]
[null,"POCKING","KÜHNHAM",275141,6529,{"$f":"+IF(A5890<>\"\",1,\"\")","v":""}]
[null,"POCKING","POCKING",275141,6530,""]
[null,"POCKING","INDLING",275141,6531,""]
[null,"POCKING","HARTKIRCHEN",275141,6532,""]
[null,"PÖCKING","MAISING",188137,9185,""]
[null,"PÖCKING","ASCHERING",188137,9188,""]
[null,"PÖCKING","PÖCKING",188137,9189,""]
[null,"POING","POING",175135,8774,""]
[null,"POLLENFELD","SEUVERSHOLZ",176155,4011,""]
[null,"POLLENFELD","POLLENFELD",176155,4012,""]
[null,"POLLENFELD","WACHENZELL",176155,4013,""]
[null,"POLLENFELD","SORNHÜLL",176155,4014,""]
[null,"POLLENFELD","WEIGERSDORF",176155,4015,""]
[null,"POLLENFELD","PREITH",176155,4016,""]
[null,"POLLING (LKR. MÜ)","FLOSSING",183136,8850,""]
[null,"POLLING (LKR. MÜ)","GRÜNBACH",183136,8851,""]
[null,"POLLING (LKR. MÜ)","POLLING",183136,8852,""]
[null,"POLLING (LKR. MÜ)","FORSTING",183136,8854,""]
[null,"POLLING (LKR. WM)","ODERDING",190142,9219,""]
[null,"POLLING (LKR. WM)","POLLING",190142,9220,""]
[null,"POLLING (LKR. WM)","ETTING",190142,9221,""]
[null,"POLSINGEN","URSHEIM",577162,3647,""]
[null,"POLSINGEN","DÖCKINGEN",577162,3648,""]
[null,"POLSINGEN","TRENDEL",577162,3649,""]
[null,"POLSINGEN","POLSINGEN",577162,3650,""]
[null,"POMMELSBRUNN","ARZLOHE",574147,3506,""]
[null,"POMMELSBRUNN","ESCHENBACH",574147,3518,""]
[null,"POMMELSBRUNN","HARTMANNSHOF",574147,3531,""]
[null,"POMMELSBRUNN","HELDMANNSBERG",574147,3533,""]
[null,"POMMELSBRUNN","HOHENSTADT",574147,3538,""]
[null,"POMMELSBRUNN","HUBMERSBERG",574147,3540,""]
[null,"POMMELSBRUNN","POMMELSBRUNN",574147,3561,""]
[null,"POMMERSFELDEN","OBERNDORF",471172,2248,""]
[null,"POMMERSFELDEN","POMMERSFELDEN",471172,2255,""]
[null,"POMMERSFELDEN","SAMBACH",471172,2275,""]
[null,"POMMERSFELDEN","STEPPACH",471172,2296,""]
[null,"POPPENHAUSEN","PFERSDORF",678168,830,""]
[null,"POPPENHAUSEN","HAIN",678168,843,""]
[null,"POPPENHAUSEN","POPPENHAUSEN",678168,855,""]
[null,"POPPENHAUSEN","KRONUNGEN",678168,856,""]
[null,"POPPENHAUSEN","MAIBACH",678168,857,""]
[null,"POPPENHAUSEN","KÜTZBERG",678168,870,""]
[null,"POPPENRICHT","POPPENRICHT",371144,4510,""]
[null,"POPPENRICHT","TRAßLBERG",371144,4515,""]
[null,"PÖRNBACH","PUCH",186144,8178,""]
[null,"PÖRNBACH","PÖRNBACH",186144,8179,""]
[null,"PÖRNBACH","RAITBACH",186144,8180,""]
[null,"PÖSING","PÖSING",372147,5036,""]
[null,"POSTAU","MOOSTHANN",274174,6595,""]
[null,"POSTAU","POSTAU",274174,6596,""]
[null,"POSTAU","GRIEßENBACH",274174,6597,""]
[null,"POSTAU","OBERKÖLLNBACH",274174,6598,""]
[null,"POSTAU","UNHOLZING",274174,6599,""]
[null,"POSTBAUER-HENG","HENG",373155,4633,""]
[null,"POSTBAUER-HENG","PAVELSBACH",373155,4663,""]
[null,"POSTBAUER-HENG","POSTBAUER",373155,4671,""]
[null,"POSTMÜNSTER","GANGERBAUER",277139,6414,""]
[null,"POSTMÜNSTER","NEUHOFEN",277139,6444,""]
[null,"POSTMÜNSTER","POSTMÜNSTER",277139,6452,""]
[null,"POSTMÜNSTER","SCHALLDORF",277139,6463,""]
[null,"POTTENSTEIN","VORDERKLEEBACH",472179,2524,""]
[null,"POTTENSTEIN","HOHENMIRSBERG",472179,2525,""]
[null,"POTTENSTEIN","HAßLACH",472179,2526,""]
[null,"POTTENSTEIN","PÜTTLACH",472179,2527,""]
[null,"POTTENSTEIN","TÜCHERSFELD",472179,2528,{"$f":"+IF(A5954<>\"\",1,\"\")","v":""}]
[null,"POTTENSTEIN","POTTENSTEIN",472179,2529,""]
[null,"POTTENSTEIN","ELBERSBERG",472179,2530,""]
[null,"POTTENSTEIN","KIRCHENBIRKIG",472179,2531,""]
[null,"POTTENSTEIN","KÜHLENFELS",472179,2532,""]
[null,"POTTENSTEIN","REGENTHAL",472179,2533,""]
[null,"POTTENSTEIN","LEIENFELS",472179,2534,""]
[null,"POTTENSTEIN","WAIDACHER FORST",472179,2547,""]
[null,"PÖTTMES","REICHERSTEIN",771156,7401,""]
[null,"PÖTTMES","ECHSHEIM",771156,7402,""]
[null,"PÖTTMES","SCHORN",771156,7403,""]
[null,"PÖTTMES","WIESENBACH",771156,7404,""]
[null,"PÖTTMES","KÜHNHAUSEN",771156,7405,""]
[null,"PÖTTMES","PÖTTMES",771156,7406,""]
[null,"PÖTTMES","GRIMOLZHAUSEN",771156,7407,""]
[null,"PÖTTMES","IMMENDORF",771156,7408,""]
[null,"PÖTTMES","OSTERZHAUSEN",771156,7409,""]
[null,"PÖTTMES","EBENRIED",771156,7410,""]
[null,"PÖTTMES","HANDZELL",771156,7411,""]
[null,"PÖTTMES","SCHNELLMANNSKREUTH",771156,7412,""]
[null,"PÖTTMES","GUNDELSDORF",771156,7413,""]
[null,"POXDORF","POXDORF",474160,2685,""]
[null,"PRACKENBACH","MOOSBACH",276135,5705,""]
[null,"PRACKENBACH","RUHMANNSDORF",276135,5706,""]
[null,"PRACKENBACH","PRACKENBACH",276135,5715,""]
[null,"PREBITZ","PREBITZ",472180,2497,""]
[null,"PREM","PREM",190143,9093,""]
[null,"PRESSATH","PRESSATH",374149,4267,""]
[null,"PRESSATH","HESSENREUTH",374149,4268,""]
[null,"PRESSATH","RIGGAU",374149,4269,""]
[null,"PRESSATH","DIEßFURT",374149,4270,""]
[null,"PRESSATHER WALD","PRESSATH",374456,4267,""]
[null,"PRESSECK","REICHENBACH",477148,1701,""]
[null,"PRESSECK","KÖSTENBERG",477148,1702,""]
[null,"PRESSECK","HEINERSREUTH",477148,1703,""]
[null,"PRESSECK","OBEREHESBERG",477148,1704,""]
[null,"PRESSECK","WARTENFELS",477148,1705,""]
[null,"PRESSECK","PRESSECK",477148,1706,""]
[null,"PRESSECK","SCHNEBES",477148,1707,""]
[null,"PRESSECK","SCHLACKENREUTH",477148,1708,""]
[null,"PRESSECK","WILDENSTEIN",477148,1709,""]
[null,"PRESSECK","RODECKER FORST-WEST",477148,1710,""]
[null,"PRESSECK","SCHWAND",477148,1712,""]
[null,"PRESSIG","FÖRTSCHENDORF",476164,1571,""]
[null,"PRESSIG","FRIEDERSDORF",476164,1572,""]
[null,"PRESSIG","ROTHENKIRCHEN",476164,1573,""]
[null,"PRESSIG","MARIENROTH",476164,1574,""]
[null,"PRESSIG","WELITSCH",476164,1575,""]
[null,"PRESSIG","PRESSIG",476164,1576,""]
[null,"PRESSIG","BRAUERSDORF",476164,1577,""]
[null,"PRESSIG","EILA",476164,1578,""]
[null,"PRESSIG","POSSECK I.BAY.",476164,1579,""]
[null,"PRESSIG","GRÖSSAU",476164,1580,""]
[null,"PRETZFELD","PRETZFELD",474161,2632,""]
[null,"PRETZFELD","LÜTZELSDORF",474161,2633,""]
[null,"PRETZFELD","HAGENBACH",474161,2634,""]
[null,"PRETZFELD","WANNBACH",474161,2635,""]
[null,"PRETZFELD","HETZELSDORF",474161,2636,""]
[null,"PRETZFELD","ZAUNSBACH",474161,2637,""]
[null,"PRETZFELD","WICHSENSTEIN",474161,2644,""]
[null,"PRICHSENSTADT","JÄRKENDORF",675158,1114,""]
[null,"PRICHSENSTADT","BRÜNNAU",675158,1115,""]
[null,"PRICHSENSTADT","NEUSES A.SAND",675158,1116,""]
[null,"PRICHSENSTADT","BIMBACH",675158,1117,""]
[null,"PRICHSENSTADT","NEUDORF",675158,1118,{"$f":"+IF(A6018<>\"\",1,\"\")","v":""}]
[null,"PRICHSENSTADT","LAUB",675158,1128,""]
[null,"PRICHSENSTADT","STADELSCHWARZACH",675158,1129,""]
[null,"PRICHSENSTADT","PRICHSENSTADT",675158,1130,""]
[null,"PRICHSENSTADT","KIRCHSCHÖNBACH",675158,1131,""]
[null,"PRICHSENSTADT","ALTENSCHÖNBACH",675158,1132,""]
[null,"PRICHSENSTADT","RÜDERN",675158,1145,""]
[null,"PRIEN A.CHIEMSEE","HITTENKIRCHEN",187162,9633,""]
[null,"PRIEN A.CHIEMSEE","PRIEN A.CHIEMSEE",187162,9660,""]
[null,"PRIEN A.CHIEMSEE","WILDENWART",187162,9683,""]
[null,"PRIESENDORF","NEUHAUSEN",471173,2239,""]
[null,"PRIESENDORF","PRIESENDORF",471173,2258,""]
[null,"PRITTRICHING","PRITTRICHING",181134,9051,""]
[null,"PRITTRICHING","WINKL",181134,9077,""]
[null,"PROSSELSHEIM","PÜSSENSHEIM",679174,680,""]
[null,"PROSSELSHEIM","PROSSELSHEIM",679174,681,""]
[null,"PRÜLL","PRÜLL",472464,2535,""]
[null,"PRUTTING","PRUTTING",187163,9661,""]
[null,"PÜCHERSREUTH","WURZ",374150,4315,""]
[null,"PÜCHERSREUTH","EPPENREUTH",374150,4316,""]
[null,"PÜCHERSREUTH","ILSENBACH",374150,4317,""]
[null,"PÜCHERSREUTH","PÜCHERSREUTH",374150,4318,""]
[null,"PUCHHEIM","PUCHHEIM",179145,8500,""]
[null,"PULLACH I.ISARTAL","PULLACH I.ISARTAL",184139,8700,""]
[null,"PULLENREUTH","HÖLL U.HAID",377148,4205,""]
[null,"PULLENREUTH","LANGENTHEILEN",377148,4206,""]
[null,"PULLENREUTH","PILGRAMSREUTH",377148,4207,""]
[null,"PULLENREUTH","MENGERSREUTH",377148,4208,""]
[null,"PULLENREUTH","DECHANTSEES",377148,4209,""]
[null,"PULLENREUTH","PULLENREUTH",377148,4210,""]
[null,"PULLENREUTH","LOCHAU",377148,4211,""]
[null,"PULLENREUTH","TREVESEN",377148,4212,""]
[null,"PULLENREUTH","NEUKÖSLARN",377148,4213,""]
[null,"PUPPLINGER AU","ERGERTSHAUSEN",173451,9312,""]
[null,"PÜRGEN","LENGENFELD",181141,9035,""]
[null,"PÜRGEN","PÜRGEN",181141,9052,""]
[null,"PÜRGEN","STOFFEN",181141,9065,""]
[null,"PÜRGEN","UMMENDORF",181141,9067,""]
[null,"PUSCHENDORF","PUSCHENDORF",573124,3330,""]
[null,"PUTZBRUNN","PUTZBRUNN",184140,8701,""]
[null,"PYRBAUM","OBERHEMBACH",373156,4657,""]
[null,"PYRBAUM","PYRBAUM",373156,4673,""]
[null,"PYRBAUM","RENGERSRICHT",373156,4677,""]
[null,"PYRBAUM","SELIGENPORTEN",373156,4682,""]
[null,"RAIN (LKR. DON)","STAUDHEIM",779201,6961,""]
[null,"RAIN (LKR. DON)","MITTELSTETTEN",779201,6962,""]
[null,"RAIN (LKR. DON)","RAIN",779201,6963,""]
[null,"RAIN (LKR. DON)","GEMPFING",779201,6964,""]
[null,"RAIN (LKR. DON)","SALLACH",779201,6965,""]
[null,"RAIN (LKR. DON)","OBERPEICHING",779201,6966,""]
[null,"RAIN (LKR. DON)","BAYERDILLING",779201,6967,""]
[null,"RAIN (LKR. DON)","ETTING",779201,6968,""]
[null,"RAIN (LKR. DON)","WÄCHTERING",779201,6969,""]
[null,"RAIN (LKR. DON)","WALLERDORF",779201,6970,""]
[null,"RAIN (LKR. SR)","PERKAM",278177,5619,""]
[null,"RAIN (LKR. SR)","RAIN",278177,5620,""]
[null,"RAISTING","RAISTING",190144,9203,""]
[null,"RAITENBUCH","BECHTHAL",577163,3730,""]
[null,"RAITENBUCH","RAITENBUCHER FORST",577163,3731,""]
[null,"RAITENBUCH","RAITENBUCH",577163,3732,""]
[null,"RAITENBUCH","REUTH A.WALD",577163,3733,""]
[null,"RAMERBERG","RAMERBERG",187164,9741,""]
[null,"RAMMINGEN","UNTERRAMMINGEN",778209,7785,""]
[null,"RAMMINGEN","OBERRAMMINGEN",778209,7786,""]
[null,"RAMSAU B.BERCHTESGAD","FORST TAUBENSEE",172129,9968,{"$f":"+IF(A6082<>\"\",1,\"\")","v":""}]
[null,"RAMSAU B.BERCHTESGAD","RAMSAU B.BERCHTESGADEN",172129,9969,""]
[null,"RAMSAU B.BERCHTESGAD","FORST HINTERSEE",172129,9973,""]
[null,"RAMSAU B.BERCHTESGAD","RAMSAUER FORST",172129,9974,""]
[null,"RAMSTHAL","RAMSTHAL",672142,289,""]
[null,"RANDERSACKER","RANDERSACKER",679175,709,""]
[null,"RANDERSACKER","LINDELBACH",679175,724,""]
[null,"RANNUNGEN","RANNUNGEN",672143,271,""]
[null,"RATTELSDORF","BUSENDORF",471174,2131,""]
[null,"RATTELSDORF","DASCHENDORFER FORST",471174,2134,""]
[null,"RATTELSDORF","EBING",471174,2146,""]
[null,"RATTELSDORF","HÖFEN B.RATTELSDORF",471174,2192,""]
[null,"RATTELSDORF","MEDLITZ",471174,2224,""]
[null,"RATTELSDORF","MÜRSBACH",471174,2234,""]
[null,"RATTELSDORF","Rattelsdorf",471174,2260,""]
[null,"RATTENBERG","RATTENBERG",278178,5556,""]
[null,"RATTENBERG","SIEGERSDORF",278178,5560,""]
[null,"RATTENKIRCHEN","RATTENKIRCHEN",183138,8836,""]
[null,"RATTISZELL","HAUNKENZELL",278179,5564,""]
[null,"RATTISZELL","HERRNFEHLBURG",278179,5566,""]
[null,"RATTISZELL","PILGRAMSBERG",278179,5570,""]
[null,"RATTISZELL","EGGERSZELL",278179,5571,""]
[null,"RATTISZELL","RATTISZELL",278179,5572,""]
[null,"RAUBLING","GROßHOLZHAUSEN",187165,9624,""]
[null,"RAUBLING","KLEINHOLZHAUSEN",187165,9643,""]
[null,"RAUBLING","PANG",187165,9657,""]
[null,"RAUBLING","PFRAUNDORF",187165,9658,""]
[null,"RAUBLING","RAUBLING",187165,9662,""]
[null,"RAUBLING","REISCHENHART",187165,9663,""]
[null,"RAUHENEBRACH","FABRIK-SCHLEICHACHER FORST-SW",674187,1024,""]
[null,"RAUHENEBRACH","FABRIK-SCHLEICHACHER FORST-NO",674187,1025,""]
[null,"RAUHENEBRACH","FABRIKSCHLEICHACH",674187,1026,""]
[null,"RAUHENEBRACH","PRÜßBERG",674187,1040,""]
[null,"RAUHENEBRACH","KARBACH",674187,1042,""]
[null,"RAUHENEBRACH","OBERSTEINBACH",674187,1043,""]
[null,"RAUHENEBRACH","GEUSFELD",674187,1049,""]
[null,"RAUHENEBRACH","WUSTVIEL",674187,1050,""]
[null,"RAUHENEBRACH","UNTERSTEINBACH",674187,1051,""]
[null,"RAUHENEBRACH","THEINHEIM",674187,1052,""]
[null,"RAUHENEBRACH","FALSBRUNN",674187,1053,""]
[null,"RAUHENEBRACH","FÜRNBACH",674187,1054,""]
[null,"RAUHENEBRACH","KOPPENWIND",674187,1060,""]
[null,"RAUHENEBRACH","PRÖLSDORF",674187,1061,""]
[null,"RECHTENBACH","RECHTENBACH",677172,552,""]
[null,"RECHTMEHRING","ROSENBERG",183139,9708,""]
[null,"RECHTMEHRING","ALLMANNSAU",183139,9709,""]
[null,"RECHTMEHRING","RECHTMEHRING",183139,9726,""]
[null,"RECHTMEHRING","SCHLEEFELD",183139,9727,""]
[null,"RECKENDORF","DASCHENDORFER FORST",471175,2134,""]
[null,"RECKENDORF","LAIMBACH",471175,2208,""]
[null,"RECKENDORF","LUßBERGER FORST",471175,2221,""]
[null,"RECKENDORF","RECKENDORF",471175,2262,""]
[null,"REDNITZHEMBACH","REDNITZHEMBACH",576137,3884,""]
[null,"REDNITZHEMBACH","WALPERSDORF",576137,3913,""]
[null,"REDWITZ A.D.RODACH","MANNSGEREUTH",478155,1406,""]
[null,"REDWITZ A.D.RODACH","REDWITZ A.D.RODACH",478155,1453,""]
[null,"REDWITZ A.D.RODACH","TRAINAU",478155,1496,""]
[null,"REDWITZ A.D.RODACH","UNTERLANGENSTADT",478155,1504,""]
[null,"REGEN","MARCH",276138,5740,""]
[null,"REGEN","OBERMITTERDORF",276138,5741,""]
[null,"REGEN","BÄRNDORF",276138,5742,""]
[null,"REGEN","REGEN",276138,5743,""]
[null,"REGEN","RINCHNACHMÜNDT",276138,5744,""]
[null,"REGEN","OBERNEUMAIS",276138,5747,""]
[null,"REGEN","REINHARTSMAIS",276138,5748,{"$f":"+IF(A6146<>\"\",1,\"\")","v":""}]
[null,"REGEN","EGGENRIED",276138,5749,""]
[null,"REGENSBURG","BARBING",362000,5208,""]
[null,"REGENSBURG","BURGWEINTING",362000,5217,""]
[null,"REGENSBURG","DECHBETTEN",362000,5218,""]
[null,"REGENSBURG","GRAß",362000,5243,""]
[null,"REGENSBURG","GROßPRÜFENING",362000,5247,""]
[null,"REGENSBURG","HARTING",362000,5256,""]
[null,"REGENSBURG","OBERISLING",362000,5295,""]
[null,"REGENSBURG","PENTLING",362000,5297,""]
[null,"REGENSBURG","PRÜLL",362000,5310,""]
[null,"REGENSBURG","REGENSBURG",362000,5313,""]
[null,"REGENSBURG","REINHAUSEN",362000,5316,""]
[null,"REGENSBURG","SALLERN",362000,5320,""]
[null,"REGENSBURG","SCHWABELWEIS",362000,5328,""]
[null,"REGENSBURG","STADTAMHOF",362000,5332,""]
[null,"REGENSBURG","STEINWEG",362000,5334,""]
[null,"REGENSBURG","WEICHS",362000,5346,""]
[null,"REGENSBURG","WINZER",362000,5351,""]
[null,"REGENSBURG","ZIEGETSDORF",362000,5359,""]
[null,"REGENSBURG","REGENSBURG, BERGWERKE",362000,5362,""]
[null,"REGENSBURG","IRL",362000,5363,""]
[null,"REGENSTAUF","BIRKENZANT",375190,5211,""]
[null,"REGENSTAUF","BUCHENLOHE",375190,5215,""]
[null,"REGENSTAUF","DIESENBACH",375190,5221,""]
[null,"REGENSTAUF","EITLBRUNN",375190,5227,""]
[null,"REGENSTAUF","GLAPFENBERG",375190,5239,""]
[null,"REGENSTAUF","GRAFENWINN",375190,5242,""]
[null,"REGENSTAUF","HAGENAU",375190,5252,""]
[null,"REGENSTAUF","HEILINGHAUSEN",375190,5260,""]
[null,"REGENSTAUF","HIRSCHLING",375190,5262,""]
[null,"REGENSTAUF","KARLSTEIN",375190,5269,""]
[null,"REGENSTAUF","LOCH",375190,5281,""]
[null,"REGENSTAUF","RAMSPAU",375190,5311,""]
[null,"REGENSTAUF","REGENSTAUF",375190,5314,""]
[null,"REGENSTAUF","SCHNEITWEG",375190,5324,""]
[null,"REGENSTAUF","SCHÖNLEITEN",375190,5327,""]
[null,"REGENSTAUF","SCHWAIGHAUSER FORST",375190,5329,""]
[null,"REGENSTAUF","STEINSBERG",375190,5333,""]
[null,"REGNITZLOSAU","DRAISENDORF",475161,1977,""]
[null,"REGNITZLOSAU","VIERSCHAU",475161,1978,""]
[null,"REGNITZLOSAU","REGNITZLOSAU",475161,1979,""]
[null,"REGNITZLOSAU","SCHWESENDORF",475161,1980,""]
[null,"REGNITZLOSAU","PREX",475161,1981,""]
[null,"REGNITZLOSAU","NENTSCHAU",475161,1983,""]
[null,"REHAU","NEUHAUSEN",475162,1967,""]
[null,"REHAU","FOHRENREUTH",475162,1968,""]
[null,"REHAU","PILGRAMSREUTH",475162,1969,""]
[null,"REHAU","REHAU",475162,1970,""]
[null,"REHAU","WURLITZ",475162,1971,""]
[null,"REHAU","FAßMANNSREUTH",475162,1972,""]
[null,"REHAU","REHAUER FORST",475162,1973,""]
[null,"REHAU","KÜHSCHWITZ",475162,1982,""]
[null,"REHAU","REHAU BERGWERK",475162,1994,""]
[null,"REHLING","REHLING",771158,7422,""]
[null,"REICHENBACH (LKR. CHA)","TIEFENBACH",372149,5123,""]
[null,"REICHENBACH (LKR. CHA)","REICHENBACH",372149,5124,""]
[null,"REICHENBACH (LKR. KC)","REICHENBACH",476166,1566,""]
[null,"REICHENBERG","GUTTENBERGER WALD",679176,706,""]
[null,"REICHENBERG","REICHENBERG",679176,716,""]
[null,"REICHENBERG","UENGERSHAUSEN",679176,720,""]
[null,"REICHENBERG","LINDFLUR",679176,721,""]
[null,"REICHENBERG","ALBERTSHAUSEN",679176,725,""]
[null,"REICHENBERG","FUCHSSTADT",679176,726,""]
[null,"REICHENSCHWAND","ALTENSITTENBACH",574150,3504,{"$f":"+IF(A6210<>\"\",1,\"\")","v":""}]
[null,"REICHENSCHWAND","REICHENSCHWAND",574150,3563,""]
[null,"REICHERSBEUERN","REICHERSBEUERN",173140,9411,""]
[null,"REICHERTSHAUSEN","LANGWAID",186146,8238,""]
[null,"REICHERTSHAUSEN","PAINDORF",186146,8239,""]
[null,"REICHERTSHAUSEN","REICHERTSHAUSEN",186146,8240,""]
[null,"REICHERTSHAUSEN","PISCHELSDORF",186146,8241,""]
[null,"REICHERTSHAUSEN","STEINKIRCHEN",186146,8242,""]
[null,"REICHERTSHEIM","REICHERTSHEIM",183140,9716,""]
[null,"REICHERTSHEIM","KRONBERG",183140,9717,""]
[null,"REICHERTSHEIM","DACHBERG",183140,9718,""]
[null,"REICHERTSHOFEN","FEILENFORST",186147,8163,""]
[null,"REICHERTSHOFEN","REICHERTSHOFEN",186147,8173,""]
[null,"REICHERTSHOFEN","HÖG",186147,8174,""]
[null,"REICHERTSHOFEN","WINDEN A.AIGN",186147,8175,""]
[null,"REICHERTSHOFEN","GOTTESHOFEN",186147,8176,""]
[null,"REICHERTSHOFEN","LANGENBRUCK",186147,8177,""]
[null,"REICHLING","LUDENHAUSEN",181135,9036,""]
[null,"REICHLING","REICHLING",181135,9054,""]
[null,"REIMLINGEN","REIMLINGEN",779203,6752,""]
[null,"REISBACH","REITH",279134,6169,""]
[null,"REISBACH","ENGLMANNSBERG",279134,6201,""]
[null,"REISBACH","GRIESBACH",279134,6202,""]
[null,"REISBACH","HABERSKIRCHEN",279134,6203,""]
[null,"REISBACH","NIEDERHAUSEN",279134,6204,""]
[null,"REISBACH","NIEDERREISBACH",279134,6205,""]
[null,"REISBACH","OBERHAUSEN",279134,6206,""]
[null,"REISBACH","REISBACH",279134,6207,""]
[null,"REISCHACH","ARBING",171129,8903,""]
[null,"REISCHACH","EGGEN",171129,8907,""]
[null,"REISCHACH","REISCHACH",171129,8933,""]
[null,"REIT IM WINKL","REIT IM WINKL",189139,9881,""]
[null,"REIT IM WINKL","FORST REIT IM WINKL",189139,9882,""]
[null,"REMLINGEN","REMLINGEN",679177,682,""]
[null,"RENNERTSHOFEN","EMSKEIM",185153,7007,""]
[null,"RENNERTSHOFEN","AMMERFELD",185153,7008,""]
[null,"RENNERTSHOFEN","HÜTTING",185153,7009,""]
[null,"RENNERTSHOFEN","ROHRBACH",185153,7010,""]
[null,"RENNERTSHOFEN","TRUGENHOFEN",185153,7011,""]
[null,"RENNERTSHOFEN","MAUERN",185153,7012,""]
[null,"RENNERTSHOFEN","ERLBACH",185153,7013,""]
[null,"RENNERTSHOFEN","RENNERTSHOFEN",185153,7014,""]
[null,"RENNERTSHOFEN","HATZENHOFEN",185153,7015,""]
[null,"RENNERTSHOFEN","BERTOLDSHEIM",185153,7016,""]
[null,"RENNERTSHOFEN","STEPPERG",185153,7017,""]
[null,"RENNERTSHOFEN","RIEDENSHEIM",185153,7018,""]
[null,"RENTWEINSDORF","LOSBERGSGEREUTH",674190,2219,""]
[null,"RENTWEINSDORF","RENTWEINSDORF",674190,2265,""]
[null,"RENTWEINSDORF","RENTWEINSDORFER HAUPTWALD",674190,2266,""]
[null,"RENTWEINSDORF","SALMSDORF",674190,2274,""]
[null,"RENTWEINSDORF","SENDELBACH",674190,2286,""]
[null,"RENTWEINSDORF","TREINFELD",674190,2309,""]
[null,"RETTENBACH (LKR. CHA)","FALKENSTEIN",372150,5135,""]
[null,"RETTENBACH (LKR. CHA)","RETTENBACH",372150,5137,""]
[null,"RETTENBACH (LKR. CHA)","EBERSROITH",372150,5138,""]
[null,"RETTENBACH (LKR. CHA)","HAAG",372150,5139,""]
[null,"RETTENBACH (LKR. GZ)","RETTENBACH",774174,7117,""]
[null,"RETTENBACH (LKR. GZ)","REMSHART",774174,7118,""]
[null,"RETTENBACH (LKR. GZ)","HARTHAUSEN",774174,7119,""]
[null,"RETTENBACH A.AUERBER","RETTENBACH A.AUERBERG",777183,7890,""]
[null,"RETTENBERG","UNTERMAISELSTEIN",780137,7975,""]
[null,"RETTENBERG","VORDERBURG",780137,7976,""]
[null,"RETTENBERG","RETTENBERG",780137,7977,""]
[null,"RETZSTADT","RETZSTADT",677175,656,""]
[null,"REUDELBERG","REUDELBERG",775453,7505,{"$f":"+IF(A6274<>\"\",1,\"\")","v":""}]
[null,"REUT","RANDLING",277140,6507,""]
[null,"REUT","REUT",277140,6508,""]
[null,"REUT","TAUBENBACH",277140,6509,""]
[null,"REUTH B.ERBENDORF","TRAUTENBERG",377149,4141,""]
[null,"REUTH B.ERBENDORF","RÖTHENBACH A.STEINWALD",377149,4142,""]
[null,"REUTH B.ERBENDORF","REUTH B.ERBENDORF",377149,4143,""]
[null,"RIED","EISMANNSBERG",771160,7382,""]
[null,"RIED","HÖRMANNSBERG",771160,7383,""]
[null,"RIED","RIED",771160,7384,""]
[null,"RIED","ZILLENBERG",771160,7385,""]
[null,"RIED","HÖGLWALD",771160,7386,""]
[null,"RIED","SIRCHENRIED",771160,7387,""]
[null,"RIED","BAINDLKIRCH",771160,7388,""]
[null,"RIEDBACH","HUMPRECHTSHAUSEN",674153,848,""]
[null,"RIEDBACH","KLEINSTEINACH",674153,849,""]
[null,"RIEDBACH","KLEINMÜNSTER",674153,862,""]
[null,"RIEDBACH","MECHENRIED",674153,863,""]
[null,"RIEDEN (LKR. AS)","TAUBENBACHER FORST",371146,4564,""]
[null,"RIEDEN (LKR. AS)","RIEDEN",371146,4566,""]
[null,"RIEDEN (LKR. AS)","SIEGENHOFEN",371146,4567,""]
[null,"RIEDEN (LKR. AS)","VILSHOFEN",371146,4568,""]
[null,"RIEDEN (LKR. OAL)","RIEDEN",777164,7845,""]
[null,"RIEDEN A.FORGGENSEE","RIEDEN AM FORGGENSEE",777163,7907,""]
[null,"RIEDENBERG","OBERRIEDENBERG",672145,164,""]
[null,"RIEDENBERG","UNTERRIEDENBERG",672145,169,""]
[null,"RIEDENBURG","DEISING",273164,5501,""]
[null,"RIEDENBURG","MEIHERN",273164,5502,""]
[null,"RIEDENBURG","PERLETZHOFEN",273164,5503,""]
[null,"RIEDENBURG","OTTERZHOFEN",273164,5504,""]
[null,"RIEDENBURG","JACHENHAUSEN",273164,5505,""]
[null,"RIEDENBURG","ALTMÜHLMÜNSTER",273164,5506,""]
[null,"RIEDENBURG","THANN",273164,5507,""]
[null,"RIEDENBURG","EGGERSBERG",273164,5508,""]
[null,"RIEDENBURG","RIEDENBURG",273164,5509,""]
[null,"RIEDENBURG","DIETERZHOFEN",273164,5510,""]
[null,"RIEDENBURG","SCHAITDORF",273164,5511,""]
[null,"RIEDENBURG","BAIERSDORF",273164,5512,""]
[null,"RIEDENBURG","KEILSDORF",273164,5513,""]
[null,"RIEDENBURG","PRUNN",273164,5514,""]
[null,"RIEDENBURG","HATTENHAUSEN",273164,5515,""]
[null,"RIEDENBURG","BUCH",273164,5516,""]
[null,"RIEDENBURG","ECHENDORF",273164,5517,""]
[null,"RIEDENBURG","PAINTNER FORST",273164,5521,""]
[null,"RIEDENHEIM","STALLDORF",679179,765,""]
[null,"RIEDENHEIM","RIEDENHEIM",679179,768,""]
[null,"RIEDERING","NEUKIRCHEN A.SIMSSEE",187167,9652,""]
[null,"RIEDERING","PIETZING",187167,9659,""]
[null,"RIEDERING","RIEDERING",187167,9664,""]
[null,"RIEDERING","SÖLLHUBEN",187167,9672,""]
[null,"RIEGSEE","AIDLING",180128,9236,""]
[null,"RIEGSEE","RIEGSEE",180128,9237,""]
[null,"RIEKOFEN","EHRING",375191,5224,""]
[null,"RIEKOFEN","RIEKOFEN",375191,5317,""]
[null,"RIEKOFEN","TAIMERING",375191,5337,""]
[null,"RIENECK","Rieneck",677177,510,""]
[null,"RIMBACH (LKR. CHA)","ZENCHING",372151,5054,""]
[null,"RIMBACH (LKR. CHA)","THENRIED",372151,5105,""]
[null,"RIMBACH (LKR. CHA)","RIMBACH",372151,5106,""]
[null,"RIMBACH (LKR. CHA)","GOTZENDORF",372151,5111,""]
[null,"RIMBACH (LKR. CHA)","HOHER BOGEN",372151,5112,""]
[null,"RIMBACH (LKR. CHA)","leer",0,0,""]
[null,"RIMBACH (LKR. PAN)","RIMBACH",277141,6456,""]
[null,"RIMBACH (LKR. PAN)","SALLACH",277141,6461,""]
[null,"RIMPAR","GRAMSCHATZ",679180,658,{"$f":"+IF(A6338<>\"\",1,\"\")","v":""}]
[null,"RIMPAR","RIMPAR",679180,668,""]
[null,"RIMPAR","MAIDBRONNER WALD",679180,675,""]
[null,"RIMPAR","MAIDBRONN",679180,676,""]
[null,"RIMSTING","GREIMHARTING",187168,9622,""]
[null,"RIMSTING","PIETZING",187168,9659,""]
[null,"RIMSTING","RIMSTING",187168,9665,""]
[null,"RINCHNACH","KASBERG",276139,5750,""]
[null,"RINCHNACH","RINCHNACH",276139,5751,""]
[null,"RINCHNACH","ELLERBACH",276139,5757,""]
[null,"RINGELAI","WASCHING",272140,5817,""]
[null,"RINGELAI","RINGELAI",272140,5843,""]
[null,"RÖCKINGEN","RÖCKINGEN",571192,3670,""]
[null,"RÖDELMAIER","RÖDELMAIER",673156,93,""]
[null,"RÖDELSEE","FRÖHSTOCKHEIM",675161,1185,""]
[null,"RÖDELSEE","RÖDELSEE",675161,1186,""]
[null,"RODEN","ANSBACH",677178,577,""]
[null,"RODEN","RODEN",677178,584,""]
[null,"RÖDENTAL","BLUMENROD",473159,1315,""]
[null,"RÖDENTAL","EINBERG",473159,1342,""]
[null,"RÖDENTAL","FISCHBACH",473159,1346,""]
[null,"RÖDENTAL","FORNBACH",473159,1347,""]
[null,"RÖDENTAL","KIPFENDORF",473159,1386,""]
[null,"RÖDENTAL","LAUTERBURG",473159,1399,""]
[null,"RÖDENTAL","MITTELBERG",473159,1417,""]
[null,"RÖDENTAL","MÖNCHRÖDEN",473159,1420,""]
[null,"RÖDENTAL","MÖNCHRÖDENER FORST",473159,1421,""]
[null,"RÖDENTAL","OBERWOHLSBACH",473159,1445,""]
[null,"RÖDENTAL","OESLAU",473159,1448,""]
[null,"RÖDENTAL","ROTHENHOF",473159,1463,""]
[null,"RÖDENTAL","SCHÖNSTÄDT",473159,1473,""]
[null,"RÖDENTAL","SPITTELSTEIN",473159,1485,""]
[null,"RÖDENTAL","UNTERWOHLSBACH",473159,1509,""]
[null,"RÖDENTAL","WALDSACHSEN",473159,1511,""]
[null,"RÖDENTAL","WALTERSDORF",473159,1512,""]
[null,"RÖDENTAL","WEIßENBRUNN VORM WALD",473159,1522,""]
[null,"RODING","FRONAU",372153,5071,""]
[null,"RODING","STRAHLFELD",372153,5072,""]
[null,"RODING","NEUBÄU",372153,5073,""]
[null,"RODING","WETTERFELD",372153,5074,""]
[null,"RODING","ALTENKREITH",372153,5075,""]
[null,"RODING","MITTERDORF",372153,5076,""]
[null,"RODING","RODING",372153,5077,""]
[null,"RODING","BRAUNRIED",372153,5078,""]
[null,"RODING","ZIEHRING",372153,5079,""]
[null,"RODING","REGENPEILSTEIN",372153,5080,""]
[null,"RODING","WIESING",372153,5081,""]
[null,"RODING","ZIMMERING",372153,5082,""]
[null,"RODING","TRASCHING",372153,5083,""]
[null,"RODING","OBERTRÜBENBACH",372153,5084,""]
[null,"RODING","KALSING",372153,5085,""]
[null,"RODING","BEUCHERLING",372153,5130,""]
[null,"RÖFINGEN","RÖFINGEN",774178,7130,""]
[null,"RÖFINGEN","ROßHAUPTEN",774178,7131,""]
[null,"ROGGENBURG","BIBERACH",775149,7097,""]
[null,"ROGGENBURG","SCHIEßEN",775149,7098,""]
[null,"ROGGENBURG","MEßHOFEN",775149,7099,""]
[null,"ROGGENBURG","INGSTETTEN",775149,7100,""]
[null,"RÖGLING","RÖGLING",779206,6916,""]
[null,"ROHR","GUSTENFELDEN",576142,3835,""]
[null,"ROHR","PRÜNST",576142,3881,""]
[null,"ROHR","REGELSBACH",576142,3885,""]
[null,"ROHR","ROHR",576142,3891,""]
[null,"ROHR I.NB","BACHL",273165,6011,""]
[null,"ROHR I.NB","HELCHENBACH",273165,6030,{"$f":"+IF(A6402<>\"\",1,\"\")","v":""}]
[null,"ROHR I.NB","LAABERBERG",273165,6046,""]
[null,"ROHR I.NB","OBEREULENBACH",273165,6067,""]
[null,"ROHR I.NB","ROHR I.NB",273165,6084,""]
[null,"ROHR I.NB","SALLINGBERG",273165,6087,""]
[null,"ROHRBACH","FEILENFORST",186149,8163,""]
[null,"ROHRBACH","GAMBACH",186149,8189,""]
[null,"ROHRBACH","ROHR",186149,8190,""]
[null,"ROHRBACH","FAHLENBACH",186149,8191,""]
[null,"ROHRBACH","ROHRBACH",186149,8192,""]
[null,"ROHRBACH","WAAL",186149,8193,""]
[null,"ROHRBACH","BURGSTALL",186149,8194,""]
[null,"ROHRBRUNNER FORST","ROHRBRUNNER FORST",671456,388,""]
[null,"ROHRDORF","HÖHENMOOS",187169,9635,""]
[null,"ROHRDORF","LAUTERBACH",187169,9645,""]
[null,"ROHRDORF","ROHRDORF",187169,9666,""]
[null,"ROHRENFELS","BALLERSDORF",185157,8087,""]
[null,"ROHRENFELS","WAGENHOFEN",185157,8088,""]
[null,"ROHRENFELS","ROHRENFELS",185157,8089,""]
[null,"RÖHRMOOS","BIBERBACH",174141,8607,""]
[null,"RÖHRMOOS","GROßINZEMOOS",174141,8619,""]
[null,"RÖHRMOOS","RÖHRMOOS",174141,8642,""]
[null,"RÖHRMOOS","SCHÖNBRUNN",174141,8644,""]
[null,"RÖHRMOOS","SIGMERTSHAUSEN",174141,8646,""]
[null,"RÖHRNBACH","KUMREUT",272141,5844,""]
[null,"RÖHRNBACH","PRAßREUT",272141,5861,""]
[null,"RÖHRNBACH","HARSDORF",272141,5862,""]
[null,"RÖHRNBACH","WILHELMSREUT",272141,5872,""]
[null,"RÖHRNBACH","OBERNDORF",272141,5873,""]
[null,"RÖHRNBACH","RÖHRNBACH",272141,5874,""]
[null,"RÖHRNBACH","AUßERNBRÜNST",272141,5875,""]
[null,"RÖLLBACH","RÖLLBACH",676151,447,""]
[null,"RÖMERSHAGER FORST-NORD","RÖMERSHAGER FORST-NORD",672464,161,""]
[null,"RÖMERSHAGER FORST-OST","RÖMERSHAGER FORST-OST",672465,168,""]
[null,"RONSBERG","RONSBERG",777165,7692,""]
[null,"ROSENHEIM","AISING",163000,9601,""]
[null,"ROSENHEIM","HAPPING",163000,9628,""]
[null,"ROSENHEIM","PANG",163000,9657,""]
[null,"ROSENHEIM","ROSENHEIM",163000,9667,""]
[null,"ROSENHEIM","WESTERNDORF ST.PETER",163000,9681,""]
[null,"RÖSLAU","NEUDES",479145,2034,""]
[null,"RÖSLAU","OBERRÖSLAU",479145,2049,""]
[null,"RÖSLAU","BÖDLAS",479145,2050,""]
[null,"RÖSLAU","DÜRNBERG",479145,2051,""]
[null,"RÖSLAU","GRÜN",479145,2052,""]
[null,"ROßBACH","MÜNCHSDORF",277142,6443,""]
[null,"ROßBACH","ROßBACH",277142,6458,""]
[null,"ROßBACH","SCHMIEDORF",277142,6464,""]
[null,"ROßBACH","THANNDORF",277142,6469,""]
[null,"ROßBACH","UNTERGRAFENDORF",277142,6472,""]
[null,"ROßBACHER FORST","ROßBACHER FORST",672466,225,""]
[null,"ROßHAUPTEN","ROßHAUPTEN",777166,7905,""]
[null,"ROßHAUPTEN","ZWIESELBERG",777166,7906,""]
[null,"ROßTAL","WEINZIERLEIN",573125,3351,""]
[null,"ROßTAL","ROßTAL",573125,3358,""]
[null,"ROßTAL","WEITERSDORF",573125,3359,""]
[null,"ROßTAL","BUCHSCHWABACH",573125,3360,""]
[null,"ROßTAL","GROßWEISMANNSDORF",573125,3361,""]
[null,"ROTH","BELMBRACH",576143,3811,""]
[null,"ROTH","BERNLOHE",576143,3812,""]
[null,"ROTH","BIRKACH",576143,3813,""]
[null,"ROTH","BRUNNAU",576143,3814,""]
[null,"ROTH","ECKERSMÜHLEN",576143,3820,""]
[null,"ROTH","HARRLACH",576143,3838,""]
[null,"ROTH","PFAFFENHOFEN",576143,3879,{"$f":"+IF(A6466<>\"\",1,\"\")","v":""}]
[null,"ROTH","RITTERSBACH",576143,3887,""]
[null,"ROTH","ROTH",576143,3892,""]
[null,"ROTH","ROTHAURACH",576143,3893,""]
[null,"ROTH","WALLESAU",576143,3909,""]
[null,"ROTH","BIRKACH - ROTH",576143,3920,""]
[null,"ROTH","BRUNNAU - ROTH",576143,3921,""]
[null,"RÖTHENBACH A.D.PEGNI","HAIMENDORF",574152,3528,""]
[null,"RÖTHENBACH A.D.PEGNI","RÖTHENBACH A.D.PEGNITZ",574152,3564,""]
[null,"RÖTHENBACH A.D.PEGNI","WETZENDORF",574152,3585,""]
[null,"RÖTHENBACH I.ALLGÄU","RÖTHENBACH (ALLGÄU)",776124,7953,""]
[null,"ROTHENBERG","ROTHENBERG",677462,553,""]
[null,"ROTHENBUCH","ROTHENBUCH",671148,374,""]
[null,"ROTHENBUCHER FORST","ROTHENBUCHER FORST",671457,381,""]
[null,"ROTHENBURG O.D.TAUBE","BETTENFELD",571193,2912,""]
[null,"ROTHENBURG O.D.TAUBE","LEUZENBRONN",571193,2990,""]
[null,"ROTHENBURG O.D.TAUBE","ROTHENBURG OB DER TAUBER",571193,3024,""]
[null,"ROTHENFELS","BERGROTHENFELS",677181,580,""]
[null,"ROTHENFELS","ROTHENFELS",677181,581,""]
[null,"RÖTHLEIN","RÖTHLEIN",678170,954,""]
[null,"RÖTHLEIN","HEIDENFELD",678170,980,""]
[null,"RÖTHLEIN","HIRSCHFELD",678170,999,""]
[null,"ROTT","ROTT",181137,9057,""]
[null,"ROTT A.INN","ROTT A.INN",187170,9771,""]
[null,"ROTT A.INN","FELDKIRCHEN",187170,9772,""]
[null,"ROTTACH-EGERN","ROTTACH-EGERN",182129,9426,""]
[null,"RÖTTENBACH (LKR. ERH)","RÖTTENBACH",572149,2830,""]
[null,"RÖTTENBACH (LKR. RH)","MÜHLSTETTEN",576141,3869,""]
[null,"RÖTTENBACH (LKR. RH)","RÖTTENBACH",576141,3890,""]
[null,"ROTTENBUCH","ROTTENBUCH",190145,9094,""]
[null,"ROTTENBUCH","SCHÖNBERG",190145,9097,""]
[null,"ROTTENBURG A.D.LAABE","NIEDEREULENBACH",274176,6551,""]
[null,"ROTTENBURG A.D.LAABE","PATTENDORF",274176,6552,""]
[null,"ROTTENBURG A.D.LAABE","OBEROTTERBACH",274176,6553,""]
[null,"ROTTENBURG A.D.LAABE","ROTTENBURG A.D.LAABER",274176,6554,""]
[null,"ROTTENBURG A.D.LAABE","NIEDERHATZKOFEN",274176,6555,""]
[null,"ROTTENBURG A.D.LAABE","NIEDERRONING",274176,6556,""]
[null,"ROTTENBURG A.D.LAABE","HEBRAMSDORF",274176,6557,""]
[null,"ROTTENBURG A.D.LAABE","OBERLAUTERBACH",274176,6560,""]
[null,"ROTTENBURG A.D.LAABE","PFEFFENHAUSEN",274176,6563,""]
[null,"ROTTENBURG A.D.LAABE","STOLLNRIED",274176,6564,""]
[null,"ROTTENBURG A.D.LAABE","SCHMATZHAUSEN",274176,6565,""]
[null,"ROTTENBURG A.D.LAABE","ANDERMANNSDORF",274176,6567,""]
[null,"ROTTENDORF","ROTTENDORF",679185,699,""]
[null,"ROTTER FORST-NORD","ROTTER FORST-NORD",187451,9775,""]
[null,"ROTTER FORST-SÜD","ROTTER FORST-SÜD",187452,9669,""]
[null,"ROTTHALMÜNSTER","ASBACH",275143,6524,""]
[null,"ROTTHALMÜNSTER","WEIHMÖRTING",275143,6525,""]
[null,"ROTTHALMÜNSTER","PATTENHAM",275143,6526,""]
[null,"ROTTHALMÜNSTER","ROTTHALMÜNSTER",275143,6527,""]
[null,"RÖTTINGEN","STRÜTH",679182,771,""]
[null,"RÖTTINGEN","AUFSTETTEN",679182,772,""]
[null,"RÖTTINGEN","RÖTTINGEN",679182,774,""]
[null,"RÖTZ","RÖTZ",372154,4955,""]
[null,"RÖTZ","BERNDORF",372154,4956,""]
[null,"RÖTZ","BERNRIED",372154,4957,""]
[null,"RÖTZ","FAHNERSDORF",372154,4958,""]
[null,"RÖTZ","DIEPOLTSRIED",372154,4959,""]
[null,"RÖTZ","GMÜND",372154,4960,""]
[null,"RÖTZ","GRASSERSDORF",372154,4961,""]
[null,"RÖTZ","HEINRICHSKIRCHEN",372154,4962,""]
[null,"RÖTZ","HETZMANNSDORF",372154,4963,""]
[null,"RÖTZ","HILLSTETT",372154,4964,""]
[null,"RÖTZ","PILLMERSRIED I",372154,4965,""]
[null,"RÖTZ","PILLMERSRIED II",372154,4966,{"$f":"+IF(A6530<>\"\",1,\"\")","v":""}]
[null,"RÖTZ","SCHATZENDORF",372154,4967,""]
[null,"RÖTZ","FLISCHBACH",372154,4968,""]
[null,"RÖTZ","STEEGEN",372154,4969,""]
[null,"RÜCKERSDORF","RÜCKERSDORF",574154,3567,""]
[null,"RÜCKERSDORF","RÜCKERSDORFER FORST",574154,3568,""]
[null,"RÜCKERSDORFER FORST","RÜCKERSDORFER FORST",574462,3568,""]
[null,"RÜCKHOLZ","RÜCKHOLZ",777168,7896,""]
[null,"RUDELZHAUSEN","BERG",178122,8251,""]
[null,"RUDELZHAUSEN","ENZELHAUSEN",178122,8252,""]
[null,"RUDELZHAUSEN","GRÜNBERG",178122,8253,""]
[null,"RUDELZHAUSEN","TEGERNBACH",178122,8254,""]
[null,"RUDELZHAUSEN","GRAFENDORF",178122,8255,""]
[null,"RÜDENAU","RÜDENAU",676153,453,""]
[null,"RÜDENHAUSEN","RÜDENHAUSEN",675162,1155,""]
[null,"RUDERATSHOFEN","APFELTRANG",777167,7872,""]
[null,"RUDERATSHOFEN","RUDERATSHOFEN",777167,7873,""]
[null,"RUDERTING","RUDERTING",275144,6324,""]
[null,"RUGENDORF","RUGENDORF",477151,1711,""]
[null,"RÜGLAND","RÜGLAND",571194,3212,""]
[null,"RÜGLAND","UNTERNBIBERT",571194,3227,""]
[null,"RUHMANNSFELDEN","RUHMANNSFELDEN",276142,5737,""]
[null,"RUHPOLDING","URSCHLAUER FORST",189140,9874,""]
[null,"RUHPOLDING","RUHPOLDING",189140,9875,""]
[null,"RUHPOLDING","VACHENAU",189140,9876,""]
[null,"RUHPOLDING","ZELL",189140,9877,""]
[null,"RUHPOLDING","SEEHAUSER FORST",189140,9878,""]
[null,"RUHPOLDING","ZELLER FORST",189140,9879,""]
[null,"RUHSTORF A.D.ROTT","EGLSEE",275145,6364,""]
[null,"RUHSTORF A.D.ROTT","SCHMIDHAM",275145,6374,""]
[null,"RUHSTORF A.D.ROTT","HÜTTING",275145,6375,""]
[null,"RUHSTORF A.D.ROTT","RUHSTORF A.D.ROTT",275145,6376,""]
[null,"RUHSTORF A.D.ROTT","EHOLFING",275145,6377,""]
[null,"RUHSTORF A.D.ROTT","SULZBACH A.INN",275145,6378,""]
[null,"RUNDING","RAINDORF",372155,5099,""]
[null,"RUNDING","NIEDERRUNDING",372155,5100,""]
[null,"RUNDING","RUNDING",372155,5101,""]
[null,"RUPPERTSHÜTTENER FORST","RUPPERTSHÜTTENER FORST",677463,525,""]
[null,"SAAL A.D.DONAU","EINMUß",273166,6020,""]
[null,"SAAL A.D.DONAU","MITTERFECKING",273166,6058,""]
[null,"SAAL A.D.DONAU","OBERSCHAMBACH",273166,6070,""]
[null,"SAAL A.D.DONAU","PETERFECKING",273166,6076,""]
[null,"SAAL A.D.DONAU","REIßING",273166,6083,""]
[null,"SAAL A.D.DONAU","SAAL A.D.DONAU",273166,6085,""]
[null,"SAAL A.D.DONAU","TEUERTING",273166,6097,""]
[null,"SAAL A.D.SAALE","WALTERSHAUSEN",673160,83,""]
[null,"SAAL A.D.SAALE","SAAL A.D.SAALE",673160,95,""]
[null,"SAALDORF","SAALDORF",172130,9932,""]
[null,"SAALDORF","SURHEIM",172130,9933,""]
[null,"SACHSEN B.ANSBACH","ALBERNDORF",571196,3102,""]
[null,"SACHSEN B.ANSBACH","RATZENWINDEN",571196,3207,""]
[null,"SACHSEN B.ANSBACH","SACHSEN B.ANSBACH",571196,3214,""]
[null,"SACHSEN B.ANSBACH","VOLKERSDORF",571196,3232,""]
[null,"SACHSENKAM","SACHSENKAM",173141,9409,""]
[null,"SAILAUF","EICHENBERG",671150,339,""]
[null,"SAILAUF","SAILAUF",671150,356,""]
[null,"SAILAUFER FORST","SAILAUFER FORST",671458,352,""]
[null,"SALCHING","SALCHING",278182,5654,""]
[null,"SALCHING","OBERPIEBING",278182,5655,""]
[null,"SALDENBURG","SALDENBURG",272142,5855,""]
[null,"SALDENBURG","FORSTÖD",272142,5856,""]
[null,"SALDENBURG","LEMBACH",272142,5857,""]
[null,"SALGEN","BRONNEN",778190,7762,""]
[null,"SALGEN","SALGEN",778190,7763,""]
[null,"SALGEN","HAUSEN",778190,7764,{"$f":"+IF(A6594<>\"\",1,\"\")","v":""}]
[null,"SALZ","SALZ",673161,103,""]
[null,"SALZWEG","STRAßKIRCHEN",275146,6328,""]
[null,"SALZWEG","SALZWEG",275146,6329,""]
[null,"SAMERBERG","GRAINBACH",187172,9621,""]
[null,"SAMERBERG","ROßHOLZEN",187172,9668,""]
[null,"SAMERBERG","STEINKIRCHEN",187172,9673,""]
[null,"SAMERBERG","TÖRWANG",187172,9676,""]
[null,"SAND A.MAIN","SAND A.MAIN",674195,963,""]
[null,"SAND A.MAIN","ZELLER FORST-WEST",674195,991,""]
[null,"SANDBERG","SANDBERG",673162,58,""]
[null,"SANDBERG","LANGENLEITEN",673162,73,""]
[null,"SANDBERG","WALDBERG",673162,74,""]
[null,"SANDBERG","SCHMALWASSER",673162,75,""]
[null,"SANDBERG","FORST SCHMALWASSER-SÜD",673162,76,""]
[null,"SANKT OSWALD","SANKT OSWALD",272459,5803,""]
[null,"SAUERLACH","SAUERLACH",184141,9306,""]
[null,"SAUERLACH","EICHENHAUSEN",184141,9307,""]
[null,"SAUERLACH","ARGET",184141,9308,""]
[null,"SAULGRUB","SAULGRUB",180129,9240,""]
[null,"SAULGRUB","UNTERAMMERGAUER FORST",180129,9250,""]
[null,"SCHÄFTLARN","SCHÄFTLARN",184142,9302,""]
[null,"SCHALKHAM","SCHALKHAM",274179,6633,""]
[null,"SCHALKHAM","JOHANNESBRUNN",274179,6634,""]
[null,"SCHAUENSTEIN","WINDISCHENGRÜN",475165,1929,""]
[null,"SCHAUENSTEIN","VOLKMANNSGRÜN",475165,1930,""]
[null,"SCHAUENSTEIN","SCHAUENSTEIN",475165,1931,""]
[null,"SCHAUENSTEIN","NEUDORF",475165,1932,""]
[null,"SCHAUENSTEIN","HAIDENGRÜN",475165,1933,""]
[null,"SCHAUFLING","SCHAUFLING",271148,5920,""]
[null,"SCHAUFLING","URLADING",271148,5921,""]
[null,"SCHAUFLING","LALLING",271148,5922,""]
[null,"SCHECHEN","HOCHSTÄTT",187142,9634,""]
[null,"SCHECHEN","MARIENBERG",187142,9648,""]
[null,"SCHECHEN","WESTERNDORF ST.PETER",187142,9681,""]
[null,"SCHEIDEGG","SCHEIDEGG",776125,7950,""]
[null,"SCHEIDEGG","SCHEFFAU",776125,7951,""]
[null,"SCHEINFELD","ERLABRONN",575161,1212,""]
[null,"SCHEINFELD","SCHNODSENBACH",575161,1213,""]
[null,"SCHEINFELD","KORNHÖFSTADT",575161,1214,""]
[null,"SCHEINFELD","BURGAMBACH",575161,1224,""]
[null,"SCHEINFELD","GRAPPERTSHOFEN",575161,1225,""]
[null,"SCHEINFELD","SCHEINFELD",575161,1226,""]
[null,"SCHEINFELD","SCHWARZENBERG",575161,1227,""]
[null,"SCHEINFELD","THIERBERG",575161,1228,""]
[null,"SCHEINFELD","OBERLAIMBACH",575161,1244,""]
[null,"SCHEINFELD","UNTERLAIMBACH",575161,1245,""]
[null,"SCHEINFELD","RUTHMANNSWEILER",575161,1246,""]
[null,"SCHELLENBERGER FORST","SCHELLENBERGER FORST",172454,9957,""]
[null,"SCHERNFELD","WORKERSZELL",176160,4005,""]
[null,"SCHERNFELD","SCHERNFELD",176160,4006,""]
[null,"SCHERNFELD","LANGENSALLACH",176160,4007,""]
[null,"SCHERNFELD","SAPPENFELD",176160,4008,""]
[null,"SCHERNFELD","SCHÖNAU",176160,4009,""]
[null,"SCHERNFELD","SCHÖNFELD",176160,4010,""]
[null,"SCHERSTETTEN","SCHERSTETTEN",772197,7318,""]
[null,"SCHERSTETTEN","KONRADSHOFEN",772197,7319,""]
[null,"SCHEßLITZ","BURGELLERN",471185,2126,""]
[null,"SCHEßLITZ","BURGHOLZ",471185,2128,""]
[null,"SCHEßLITZ","BURGLESAU",471185,2129,""]
[null,"SCHEßLITZ","DEMMELSDORF",471185,2135,""]
[null,"SCHEßLITZ","DÖRRNWASSERLOS",471185,2140,""]
[null,"SCHEßLITZ","EHRL",471185,2150,""]
[null,"SCHEßLITZ","GRUMBACH",471185,2173,""]
[null,"SCHEßLITZ","HOHENHÄUSLING",471185,2193,{"$f":"+IF(A6658<>\"\",1,\"\")","v":""}]
[null,"SCHEßLITZ","Ludwag",471185,2220,""]
[null,"SCHEßLITZ","NEUDORF B.SCHEßLITZ",471185,2236,""]
[null,"SCHEßLITZ","PEULENDORF",471185,2251,""]
[null,"SCHEßLITZ","ROSCHLAUB",471185,2271,""]
[null,"SCHEßLITZ","SCHEßLITZ",471185,2280,""]
[null,"SCHEßLITZ","SCHWEISDORF",471185,2283,""]
[null,"SCHEßLITZ","STRAßGIECH",471185,2298,""]
[null,"SCHEßLITZ","STÜBIG",471185,2300,""]
[null,"SCHEßLITZ","WEICHENWASSERLOS",471185,2333,""]
[null,"SCHEßLITZ","WIESENGIECH",471185,2337,""]
[null,"SCHEßLITZ","WINDISCHLETTEN",471185,2339,""]
[null,"SCHEßLITZ","WÜRGAU",471185,2341,""]
[null,"SCHEßLITZ","ZECKENDORF",471185,2344,""]
[null,"SCHEURING","SCHEURING",181138,9059,""]
[null,"SCHEYERN","EUERNBACH",186151,8208,""]
[null,"SCHEYERN","VIETH",186151,8209,""]
[null,"SCHEYERN","MITTERSCHEYERN",186151,8210,""]
[null,"SCHEYERN","WINDEN B.SCHEYERN",186151,8211,""]
[null,"SCHEYERN","SCHEYERN",186151,8212,""]
[null,"SCHEYERN","TRIEFING",186151,8213,""]
[null,"SCHIERLING","ALLERSDORF",375196,5202,""]
[null,"SCHIERLING","BUCHHAUSEN",375196,5216,""]
[null,"SCHIERLING","INKOFEN",375196,5267,""]
[null,"SCHIERLING","SCHIERLING",375196,5323,""]
[null,"SCHIERLING","UNTERLAICHLING",375196,5343,""]
[null,"SCHIERLING","ZAITZKOFEN",375196,5357,""]
[null,"SCHILLINGSFÜRST","FAULENBERG",571198,2945,""]
[null,"SCHILLINGSFÜRST","SCHILLINGSFÜRST",571198,3027,""]
[null,"SCHILLINGSFÜRST","STILZENDORF",571198,3040,""]
[null,"SCHILTBERG","RAPPERZELL",771162,7439,""]
[null,"SCHILTBERG","SCHILTBERG",771162,7440,""]
[null,"SCHILTBERG","RUPPERTSZELL",771162,7441,""]
[null,"SCHILTBERG","ALLENBERG",771162,7442,""]
[null,"SCHILTBERG","AUFHAUSEN",771162,7443,""]
[null,"SCHIRMITZ","SCHIRMITZ",374154,4398,""]
[null,"SCHIRNDING","FISCHERN",479147,2041,""]
[null,"SCHIRNDING","SCHIRNDING",479147,2042,""]
[null,"SCHIRNDING","KOTHIGENBIBERSBACH",479147,2043,""]
[null,"SCHIRNDING","SEEDORF",479147,2044,""]
[null,"SCHIRNDING","ARZBERGER FORST",479147,2045,""]
[null,"SCHLAMMERSDORF","SCHLAMMERSDORF",374155,4249,""]
[null,"SCHLAMMERSDORF","MOOS",374155,4250,""]
[null,"SCHLECHING","SCHLECHINGER FORST",189141,9870,""]
[null,"SCHLECHING","SCHLECHING",189141,9871,""]
[null,"SCHLECHING","OBERWÖSSEN",189141,9872,""]
[null,"SCHLEHDORF","SCHLEHDORF",173142,9415,""]
[null,"SCHLICHTENBERGER WALD","ANNATHAL",272460,5810,""]
[null,"SCHLICHTENBERGER WALD","HERZOGSREUT",272460,5820,""]
[null,"SCHLICHTENBERGER WALD","BISCHOFSREUT",272460,5822,""]
[null,"SCHLIERSEE","SCHLIERSEE",182131,9521,""]
[null,"SCHLÜSSELFELD","ASCHBACH",471220,2108,""]
[null,"SCHLÜSSELFELD","ECKERSBACH",471220,2149,""]
[null,"SCHLÜSSELFELD","ELSENDORF",471220,2153,""]
[null,"SCHLÜSSELFELD","HEUCHELHEIM",471220,2189,""]
[null,"SCHLÜSSELFELD","REICHMANNSDORF",471220,2264,""]
[null,"SCHLÜSSELFELD","SCHLÜSSELFELD",471220,2281,""]
[null,"SCHLÜSSELFELD","THÜNGFELD",471220,2303,""]
[null,"SCHLÜSSELFELD","UNTERMELSENDORF",471220,2317,""]
[null,"SCHLÜSSELFELD","ZIEGELSAMBACH",471220,2347,""]
[null,"SCHMELLERFORST","SCHMELLERFORST",772451,7297,""]
[null,"SCHMIDGADEN","ROTTENDORF",376159,4851,""]
[null,"SCHMIDGADEN","GÖSSELSDORF",376159,4852,""]
[null,"SCHMIDGADEN","TRISCHING",376159,4853,""]
[null,"SCHMIDGADEN","SCHMIDGADEN",376159,4854,{"$f":"+IF(A6722<>\"\",1,\"\")","v":""}]
[null,"SCHMIDMÜHLEN","WINBUCH",371148,4565,""]
[null,"SCHMIDMÜHLEN","SCHMIDMÜHLEN",371148,4569,""]
[null,"SCHMIDMÜHLEN","EMHOF",371148,4570,""]
[null,"SCHMIECHEN","UNTERBERGEN",771163,7395,""]
[null,"SCHMIECHEN","SCHMIECHEN",771163,7396,""]
[null,"SCHNABELWAID","SCHNABELWAID",472184,2498,""]
[null,"SCHNABELWAID","PREUNERSFELD",472184,2499,""]
[null,"SCHNABELWAID","SCHNABELWAIDER KÜTSCHENRAIN",472184,2500,""]
[null,"SCHNAITSEE","SCHNAITSEE",189142,9801,""]
[null,"SCHNAITSEE","WALDHAUSEN",189142,9802,""]
[null,"SCHNAITSEE","KIRCHSTÄTT",189142,9803,""]
[null,"SCHNAITTACH","BONDORF",574155,3510,""]
[null,"SCHNAITTACH","FREIRÖTTENBACH",574155,3520,""]
[null,"SCHNAITTACH","GERMERSBERG",574155,3521,""]
[null,"SCHNAITTACH","GROßBELLHOFEN",574155,3522,""]
[null,"SCHNAITTACH","HAIDLING",574155,3527,""]
[null,"SCHNAITTACH","HEDERSDORF",574155,3532,""]
[null,"SCHNAITTACH","HORMERSDORF",574155,3539,""]
[null,"SCHNAITTACH","KIRCHRÖTTENBACH",574155,3545,""]
[null,"SCHNAITTACH","OSTERNOHE",574155,3558,""]
[null,"SCHNAITTACH","RABENSHOF",574155,3562,""]
[null,"SCHNAITTACH","SCHNAITTACH",574155,3569,""]
[null,"SCHNAITTACH","SIEGERSDORF",574155,3572,""]
[null,"SCHNAITTENBACH","HIRSCHAU",371150,4490,""]
[null,"SCHNAITTENBACH","SCHARHOF",371150,4491,""]
[null,"SCHNAITTENBACH","SCHNAITTENBACH",371150,4492,""]
[null,"SCHNAITTENBACH","FORST",371150,4493,""]
[null,"SCHNAITTENBACH","HOLZHAMMER",371150,4494,""]
[null,"SCHNAITTENBACH","KEMNATH A.BUCHBERG",371150,4524,""]
[null,"SCHNECKENLOHE","MÖDLITZ",476171,1639,""]
[null,"SCHNECKENLOHE","SCHNECKENLOHE",476171,1640,""]
[null,"SCHNECKENLOHE","BEIKHEIM",476171,1641,""]
[null,"SCHNEEBERG","SCHNEEBERG",676156,469,""]
[null,"SCHNEEBERG","ZITTENFELDEN",676156,479,""]
[null,"SCHNEEBERG","HAMBRUNN",676156,480,""]
[null,"SCHNEIZLREUTH","KARLSTEINER FORST",172131,9942,""]
[null,"SCHNEIZLREUTH","WEIßBACH A.D.ALPENSTRAßE",172131,9943,""]
[null,"SCHNEIZLREUTH","WEIßBACHER FORST",172131,9944,""]
[null,"SCHNEIZLREUTH","RISTFEUCHT",172131,9945,""]
[null,"SCHNEIZLREUTH","JETTENBERG",172131,9946,""]
[null,"SCHNEIZLREUTH","JETTENBERGER FORST",172131,9967,""]
[null,"SCHNELLDORF","GAILROTH",571199,2949,""]
[null,"SCHNELLDORF","HAUNDORF",571199,2966,""]
[null,"SCHNELLDORF","OBERAMPFRACH",571199,3006,""]
[null,"SCHNELLDORF","UNTERAMPFRACH",571199,3048,""]
[null,"SCHNELLDORF","WILDENHOLZ",571199,3067,""]
[null,"SCHÖFWEG","ALLHARTSMAIS",272145,5828,""]
[null,"SCHÖFWEG","SCHÖFWEG",272145,5829,""]
[null,"SCHÖFWEG","HILGENREITH",272145,5831,""]
[null,"SCHOLLBRUNN","SCHOLLBRUNN",677182,597,""]
[null,"SCHÖLLKRIPPEN","HOFSTÄDTEN",671152,311,""]
[null,"SCHÖLLKRIPPEN","SCHNEPPENBACH",671152,312,""]
[null,"SCHÖLLKRIPPEN","SCHÖLLKRIPPEN",671152,328,""]
[null,"SCHÖLLKRIPPENER FORST","SCHÖLLKRIPPENER FORST",671459,330,""]
[null,"SCHÖLLNACH","WINSING",271149,5927,""]
[null,"SCHÖLLNACH","SCHWANENKIRCHEN",271149,5947,""]
[null,"SCHÖLLNACH","SCHÖLLNACH",271149,5948,""]
[null,"SCHÖLLNACH","TAIDING",271149,5949,""]
[null,"SCHÖLLNACH","RIGGERDING",271149,5950,""]
[null,"SCHÖLLNACH","AUßERNZELL",271149,5952,""]
[null,"SCHÖNAU","SCHÖNAU",277144,6465,""]
[null,"SCHÖNAU","UNTERHÖFT",277144,6475,""]
[null,"SCHÖNAU","UNTERZEITLARN",277144,6476,""]
[null,"SCHÖNAU A.D.BREND","SCHÖNAU A.D.BREND",673163,42,{"$f":"+IF(A6786<>\"\",1,\"\")","v":""}]
[null,"SCHÖNAU A.D.BREND","BURGWALLBACH",673163,61,""]
[null,"SCHÖNAU A.KÖNIGSSEE","SCHÖNAU",172132,9970,""]
[null,"SCHÖNAU A.KÖNIGSSEE","KÖNIGSSEE",172132,9971,""]
[null,"SCHÖNAU A.KÖNIGSSEE","FORST KÖNIGSSEE",172132,9972,""]
[null,"SCHÖNAU A.KÖNIGSSEE","FORST SANKT BARTHOLOMÄ",172132,9975,""]
[null,"SCHÖNBERG","SCHÖNBERG",183143,8813,""]
[null,"SCHÖNBERG (LKR. FRG)","GROßMISSELBERG",272147,5824,""]
[null,"SCHÖNBERG (LKR. FRG)","HARTMANNSREIT",272147,5825,""]
[null,"SCHÖNBERG (LKR. FRG)","INNERNZELL",272147,5832,""]
[null,"SCHÖNBERG (LKR. FRG)","MITTERNACH",272147,5833,""]
[null,"SCHÖNBERG (LKR. FRG)","SCHÖNBERG",272147,5834,""]
[null,"SCHÖNBERG (LKR. FRG)","KIRCHBERG",272147,5838,""]
[null,"SCHÖNBERG (LKR. FRG)","EBERHARDSREUTH",272147,5839,""]
[null,"SCHÖNBERG (LKR. LAU)","SCHÖNBERG",574463,3570,""]
[null,"SCHÖNBERG (LKR. MÜ)","ASPERTSHAM",183143,8812,""]
[null,"SCHÖNBRUNN I.STEIGER","GRUB",471186,2172,""]
[null,"SCHÖNBRUNN I.STEIGER","HALBERSDORF",471186,2178,""]
[null,"SCHÖNBRUNN I.STEIGER","SCHÖNBRUNN I.STEIGERWALD",471186,2282,""]
[null,"SCHÖNBRUNN I.STEIGER","STEINSDORF",471186,2295,""]
[null,"SCHÖNBRUNN I.STEIGER","ZETTMANNSDORF",471186,2346,""]
[null,"SCHÖNBRUNNER WALD","SCHÖNBRUNN A.LUSEN",272461,5808,""]
[null,"SCHONDORF A.AMMERSEE","OBERSCHONDORF",181139,9044,""]
[null,"SCHONDORF A.AMMERSEE","UNTERSCHONDORF",181139,9072,""]
[null,"SCHONDRA","SCHONDRA",672149,186,""]
[null,"SCHONDRA","SINGENRAIN",672149,210,""]
[null,"SCHONDRA","SCHÖNDERLING",672149,214,""]
[null,"SCHONDRA","DETTER",672149,226,""]
[null,"SCHONDRA","GEIERSNEST-OST",672149,227,""]
[null,"SCHONGAU","SCHONGAU",190148,9096,""]
[null,"SCHÖNGEISING","SCHÖNGEISING",179147,8495,""]
[null,"SCHÖNSEE","MITTERLANGAU",376160,4835,""]
[null,"SCHÖNSEE","PIRKHOF",376160,4838,""]
[null,"SCHÖNSEE","FRIEDRICHSHÄNG",376160,4844,""]
[null,"SCHÖNSEE","DIETERSDORF",376160,4845,""]
[null,"SCHÖNSEE","SCHWAND",376160,4846,""]
[null,"SCHÖNSEE","SCHÖNSEE",376160,4847,""]
[null,"SCHÖNSEE","GAISTHAL",376160,4848,""]
[null,"SCHÖNSEE","WEIDING",376160,4849,""]
[null,"SCHONSTETT","SCHONSTETT",187173,9781,""]
[null,"SCHONSTETT","ZILLHAM",187173,9782,""]
[null,"SCHÖNTHAL","FLISCHBACH",372157,4968,""]
[null,"SCHÖNTHAL","STEEGEN",372157,4969,""]
[null,"SCHÖNTHAL","SCHÖNTHAL",372157,4970,""]
[null,"SCHÖNTHAL","DÖFERING",372157,4971,""]
[null,"SCHÖNTHAL","HILTERSRIED",372157,4972,""]
[null,"SCHÖNTHAL","LOITENDORF",372157,4973,""]
[null,"SCHÖNTHAL","PREMEISCHL",372157,4974,""]
[null,"SCHÖNTHAL","ÖD",372157,4975,""]
[null,"SCHÖNTHAL","THURAU",372157,4976,""]
[null,"SCHONUNGEN","REICHMANNSHAUSEN",678174,847,""]
[null,"SCHONUNGEN","LÖFFELSTERZ",678174,861,""]
[null,"SCHONUNGEN","HAUSEN",678174,875,""]
[null,"SCHONUNGEN","MARKTSTEINACH",678174,876,""]
[null,"SCHONUNGEN","ABERSFELD",678174,877,""]
[null,"SCHONUNGEN","MAINBERG",678174,893,""]
[null,"SCHONUNGEN","SCHONUNGEN",678174,894,""]
[null,"SCHONUNGEN","WALDSACHSEN",678174,895,""]
[null,"SCHONUNGEN","FORST",678174,914,""]
[null,"SCHÖNWALD","SCHÖNWALD",479150,2001,""]
[null,"SCHÖNWALD","LAUTERBACH",479150,2002,""]
[null,"SCHÖNWALD","BUCHBACH",479150,2003,""]
[null,"SCHÖNWALD","VIELITZ",479150,2004,""]
[null,"SCHOPFLOCH","DICKERSBRONN",571200,2927,""]
[null,"SCHOPFLOCH","LEHENGÜTINGEN",571200,2988,{"$f":"+IF(A6850<>\"\",1,\"\")","v":""}]
[null,"SCHOPFLOCH","SCHOPFLOCH",571200,3028,""]
[null,"SCHOPFLOCH","WALDHÄUSLEIN",571200,3057,""]
[null,"SCHOPFLOCH","ZWERNBERG",571200,3071,""]
[null,"SCHORNDORF","OBERTRAUBENBACH",372158,5141,""]
[null,"SCHORNDORF","PENTING",372158,5142,""]
[null,"SCHORNDORF","HÖTZING",372158,5143,""]
[null,"SCHORNDORF","SCHORNDORF",372158,5144,""]
[null,"SCHORNDORF","THIERLING",372158,5145,""]
[null,"SCHORNDORF","NEUHAUS",372158,5146,""]
[null,"SCHROBENHAUSEN","EDELSHAUSEN",185158,8098,""]
[null,"SCHROBENHAUSEN","SANDIZELL",185158,8099,""]
[null,"SCHROBENHAUSEN","HAGENAUER FORST",185158,8100,""]
[null,"SCHROBENHAUSEN","STEINGRIFF",185158,8101,""]
[null,"SCHROBENHAUSEN","SCHROBENHAUSEN",185158,8102,""]
[null,"SCHROBENHAUSEN","MÜHLRIED",185158,8103,""]
[null,"SCHROBENHAUSEN","HÖRZHAUSEN",185158,8104,""]
[null,"SCHWABACH","GROßSCHWARZENLOHE",565000,3832,""]
[null,"SCHWABACH","KLEINSCHWARZENLOHE",565000,3852,""]
[null,"SCHWABACH","OTTERSDORF",565000,3875,""]
[null,"SCHWABACH","PENZENDORF",565000,3877,""]
[null,"SCHWABACH","SCHWABACH",565000,3898,""]
[null,"SCHWABACH","UNTERREICHENBACH",565000,3912,""]
[null,"SCHWABACH","WOLKERSDORF",565000,3918,""]
[null,"SCHWABBRUCK","SCHWABBRUCK",190149,9098,""]
[null,"SCHWABHAUSEN","ARNBACH",174143,8604,""]
[null,"SCHWABHAUSEN","KREUZHOLZHAUSEN",174143,8626,""]
[null,"SCHWABHAUSEN","OBERROTH",174143,8633,""]
[null,"SCHWABHAUSEN","PUCHSCHLAGEN",174143,8640,""]
[null,"SCHWABHAUSEN","RUMELTSHAUSEN",174143,8643,""]
[null,"SCHWABHAUSEN","SCHWABHAUSEN",174143,8645,""]
[null,"SCHWABMÜNCHEN","SCHWABMÜNCHEN",772200,7326,""]
[null,"SCHWABMÜNCHEN","BIRKACH",772200,7327,""]
[null,"SCHWABMÜNCHEN","KLIMMACH",772200,7328,""]
[null,"SCHWABMÜNCHEN","MITTELSTETTEN",772200,7329,""]
[null,"SCHWABMÜNCHEN","SCHWABEGG",772200,7330,""]
[null,"SCHWABSOIEN","SACHSENRIED",190151,9095,""]
[null,"SCHWABSOIEN","SCHWABSOIEN",190151,9100,""]
[null,"SCHWAIG B.NÜRNBERG","BEHRINGERSDORF",574156,3404,""]
[null,"SCHWAIG B.NÜRNBERG","SCHWAIG B.NÜRNBERG",574156,3465,""]
[null,"SCHWAIGEN","SCHWAIGEN",180131,9247,""]
[null,"SCHWAIGHAUSER FORST","SCHWAIGHAUSER FORST",375455,5329,""]
[null,"SCHWANDER FORST","SCHWAND",374457,4306,""]
[null,"SCHWANDORF","FRONBERG",376161,4751,""]
[null,"SCHWANDORF","KRONDORF",376161,4752,""]
[null,"SCHWANDORF","KRONSTETTEN",376161,4753,""]
[null,"SCHWANDORF","HASELBACH",376161,4754,""]
[null,"SCHWANDORF","ETTMANNSDORF",376161,4755,""]
[null,"SCHWANDORF","NEUKIRCHEN",376161,4758,""]
[null,"SCHWANDORF","GÖGGLBACH",376161,4759,""]
[null,"SCHWANDORF","SCHWANDORF",376161,4760,""]
[null,"SCHWANDORF","NAABECK",376161,4764,""]
[null,"SCHWANDORF","DACHELHOFEN",376161,4765,""]
[null,"SCHWANDORF","WIEFELSDORF",376161,4767,""]
[null,"SCHWANDORF","KLARDORF",376161,4768,""]
[null,"SCHWANDORF","BUBACH A.D.NAAB",376161,4773,""]
[null,"SCHWANFELD","SCHWANFELD",678175,1013,""]
[null,"SCHWANGAU","SCHWANGAU",777169,7916,""]
[null,"SCHWANSTETTEN","LEERSTETTEN",576132,3860,""]
[null,"SCHWANSTETTEN","SCHWAND B.NÜRNBERG",576132,3899,""]
[null,"SCHWARZACH","SCHWARZACHER HOCHWALD",278187,5601,""]
[null,"SCHWARZACH","SCHWARZACH",278187,5617,""]
[null,"SCHWARZACH","ALBERTSRIED",278187,5618,""]
[null,"SCHWARZACH A.MAIN","GERLACHSHAUSEN",675165,1125,""]
[null,"SCHWARZACH A.MAIN","SCHWARZENAU",675165,1137,{"$f":"+IF(A6914<>\"\",1,\"\")","v":""}]
[null,"SCHWARZACH A.MAIN","MÜNSTERSCHWARZACH",675165,1138,""]
[null,"SCHWARZACH A.MAIN","STADTSCHWARZACH",675165,1139,""]
[null,"SCHWARZACH A.MAIN","DÜLLSTADT",675165,1140,""]
[null,"SCHWARZACH A.MAIN","HÖRBLACH",675165,1152,""]
[null,"SCHWARZACH B.NABBURG","SCHWARZACH B.NABBURG",376162,4876,""]
[null,"SCHWARZACH B.NABBURG","ALTFALTER",376162,4877,""]
[null,"SCHWARZACH B.NABBURG","UNTERAUERBACH",376162,4878,""]
[null,"SCHWARZACH B.NABBURG","WEIDING IN SCHWARZACH",376162,4879,""]
[null,"SCHWARZENBACH","PECHHOF",374156,4350,""]
[null,"SCHWARZENBACH","SCHWARZENBACH",374156,4351,""]
[null,"SCHWARZENBACH","MANTELER FORST",374156,4352,""]
[null,"SCHWARZENBACH A.D.SA","GOTTFRIEDSREUTH",475168,1896,""]
[null,"SCHWARZENBACH A.D.SA","SEULBITZ",475168,1955,""]
[null,"SCHWARZENBACH A.D.SA","HALLERSTEIN",475168,1956,""]
[null,"SCHWARZENBACH A.D.SA","SCHWARZENBACH A.D.SAALE",475168,1957,""]
[null,"SCHWARZENBACH A.D.SA","MARTINLAMITZ",475168,1958,""]
[null,"SCHWARZENBACH A.D.SA","QUELLENREUTH",475168,1959,""]
[null,"SCHWARZENBACH A.D.SA","STOBERSREUTH",475168,1960,""]
[null,"SCHWARZENBACH A.D.SA","FÖRBAU",475168,1961,""]
[null,"SCHWARZENBACH A.D.SA","HALLERSTEINER FORST-NORDWEST",475168,1962,""]
[null,"SCHWARZENBACH A.WALD","RODECKER FORST-WEST",475169,1710,""]
[null,"SCHWARZENBACH A.WALD","BERNSTEIN A.WALD",475169,1917,""]
[null,"SCHWARZENBACH A.WALD","LÖHMAR",475169,1918,""]
[null,"SCHWARZENBACH A.WALD","RÄUMLAS",475169,1919,""]
[null,"SCHWARZENBACH A.WALD","MEIERHOF",475169,1920,""]
[null,"SCHWARZENBACH A.WALD","SCHWARZENSTEIN",475169,1921,""]
[null,"SCHWARZENBACH A.WALD","KLEINDÖBRA",475169,1922,""]
[null,"SCHWARZENBACH A.WALD","FORST SCHWARZENBACH A.WALD",475169,1923,""]
[null,"SCHWARZENBACH A.WALD","STRAßDORF",475169,1924,""]
[null,"SCHWARZENBACH A.WALD","SCHWARZENBACH A.WALD",475169,1925,""]
[null,"SCHWARZENBACH A.WALD","DÖBRA",475169,1926,""]
[null,"SCHWARZENBACH A.WALD","RODECKER FORST-OST",475169,1927,""]
[null,"SCHWARZENBACH A.WALD","RODECK",475169,1928,""]
[null,"SCHWARZENBRUCK","ALTENTHANN",574157,3403,""]
[null,"SCHWARZENBRUCK","LINDELBURG",574157,3443,""]
[null,"SCHWARZENBRUCK","OBERFERRIEDEN",574157,3451,""]
[null,"SCHWARZENBRUCK","SCHWARZENBRUCK",574157,3467,""]
[null,"SCHWARZENFELD","FROTZERSRICHT",376163,4858,""]
[null,"SCHWARZENFELD","SCHWARZENFELD",376163,4873,""]
[null,"SCHWARZENFELD","PRETZABRUCK",376163,4874,""]
[null,"SCHWARZENFELD","SONNENRIED",376163,4875,""]
[null,"SCHWARZHOFEN","SCHWARZHOFEN",376164,4901,""]
[null,"SCHWARZHOFEN","DEMELDORF",376164,4902,""]
[null,"SCHWARZHOFEN","HAAG B.SCHWARZHOFEN",376164,4903,""]
[null,"SCHWARZHOFEN","SCHWARZENECK",376164,4904,""]
[null,"SCHWARZHOFEN","UCKERSDORF",376164,4905,""]
[null,"SCHWARZHOFEN","ZANGENSTEIN",376164,4906,""]
[null,"SCHWEBHEIM","SCHWEBHEIM",678176,955,""]
[null,"SCHWEINFURT","SCHWEINFURT",662000,891,""]
[null,"SCHWEINFURT","OBERNDORF",662000,912,""]
[null,"SCHWEITENKIRCHEN","EBERSTETTEN",186152,8207,""]
[null,"SCHWEITENKIRCHEN","GEISENHAUSEN",186152,8229,""]
[null,"SCHWEITENKIRCHEN","SCHWEITENKIRCHEN",186152,8230,""]
[null,"SCHWEITENKIRCHEN","DÜRNZHAUSEN",186152,8231,""]
[null,"SCHWEITENKIRCHEN","SÜNZHAUSEN",186152,8232,""]
[null,"SCHWEITENKIRCHEN","AUFHAM",186152,8233,""]
[null,"SCHWENNINGEN","SCHWENNINGEN",773164,6829,""]
[null,"SCHWENNINGEN","GREMHEIM",773164,6830,""]
[null,"SCHWIFTING","SCHWIFTING",181140,9062,""]
[null,"SCHWINDEGG","WALKERSAICH",183144,8826,""]
[null,"SCHWINDEGG","SCHWINDEGG",183144,8828,""]
[null,"SEEFELD","MEILING",188132,9161,""]
[null,"SEEFELD","OBERALTING-SEEFELD",188132,9166,""]
[null,"SEEFELD","HECHENDORF A.PILSENSEE",188132,9169,{"$f":"+IF(A6978<>\"\",1,\"\")","v":""}]
[null,"SEEFELD","DRÖßLING",188132,9170,""]
[null,"SEEFELD","UNERING",188132,9171,""]
[null,"SEEG","SEEG",777170,7897,""]
[null,"SEEG","OSTERWALD",777170,7898,""]
[null,"SEEG","SENKELEWALD",777170,7899,""]
[null,"SEEG","ENZENSTETTEN",777170,7900,""]
[null,"SEEG","LANGEGG",777170,7901,""]
[null,"SEEG","HACK",777170,7919,""]
[null,"SEEHAUSEN A.STAFFELS","SEEHAUSEN A.STAFFELSEE",180132,9238,""]
[null,"SEEON-SEEBRUCK","SEEON",189143,9814,""]
[null,"SEEON-SEEBRUCK","SEEBRUCK",189143,9821,""]
[null,"SEEON-SEEBRUCK","TRUCHTLACHING",189143,9822,""]
[null,"SEESHAUPT","MAGNETSRIED",190152,9213,""]
[null,"SEESHAUPT","SEESHAUPT",190152,9214,""]
[null,"SEGNITZ","SEGNITZ",675166,1203,""]
[null,"SEINSHEIM","TIEFENSTOCKHEIM",675167,1219,""]
[null,"SEINSHEIM","WÄSSERNDORF",675167,1235,""]
[null,"SEINSHEIM","IFFIGHEIM",675167,1236,""]
[null,"SEINSHEIM","SEINSHEIM",675167,1237,""]
[null,"SELB","LAUTERBACH",479152,2002,""]
[null,"SELB","VIELITZ",479152,2004,""]
[null,"SELB","SELB-PLÖßBERG",479152,2005,""]
[null,"SELB","ERKERSREUTH",479152,2006,""]
[null,"SELB","MÜHLBACH",479152,2007,""]
[null,"SELB","SELB",479152,2008,""]
[null,"SELB","LÄNGENAU",479152,2009,""]
[null,"SELB","BUCHWALD",479152,2010,""]
[null,"SELB","STEINSELB",479152,2011,""]
[null,"SELB","OBERWEIßENBACH",479152,2012,""]
[null,"SELB","UNTERWEIßENBACH",479152,2013,""]
[null,"SELB","SPIELBERG",479152,2014,""]
[null,"SELB","HEIDELHEIM",479152,2015,""]
[null,"SELB","SILBERBACH",479152,2016,""]
[null,"SELB","KAISERHAMMER FORST-WEST",479152,2026,""]
[null,"SELB","SELBER FORST",479152,2027,""]
[null,"SELBER FORST","SELBER FORST",479458,2027,""]
[null,"SELBITZ","DÖRNTHAL",475171,1906,""]
[null,"SELBITZ","NEUHAUS",475171,1907,""]
[null,"SELBITZ","RODESGRÜN",475171,1908,""]
[null,"SELBITZ","SELBITZ",475171,1909,""]
[null,"SELBITZ","WEIDESGRÜN",475171,1910,""]
[null,"SEMBERG","SEMBERG",471459,2285,""]
[null,"SENDEN","GERLENHOFEN",775152,7060,""]
[null,"SENDEN","AY A.D.ILLER",775152,7081,""]
[null,"SENDEN","SENDEN",775152,7082,""]
[null,"SENDEN","AUFHEIM",775152,7083,""]
[null,"SENDEN","HITTISTETTEN",775152,7084,""]
[null,"SENDEN","WULLENSTETTEN",775152,7085,""]
[null,"SENDEN","WITZIGHAUSEN",775152,7086,""]
[null,"SENDEN","FREUDENEGG",775152,7183,""]
[null,"SENGENTHAL","FORST",373159,4619,""]
[null,"SENGENTHAL","REICHERTSHOFEN",373159,4675,""]
[null,"SENGENTHAL","SENGENTHAL",373159,4683,""]
[null,"SENGENTHAL","STAUF",373159,4687,""]
[null,"SENNFELD","SENNFELD",678178,892,""]
[null,"SEßLACH","AUTENHAUSEN",473165,1306,""]
[null,"SEßLACH","BISCHWIND",473165,1314,""]
[null,"SEßLACH","DIETERSDORF",473165,1332,""]
[null,"SEßLACH","GEMÜNDA I.OFR.",473165,1356,""]
[null,"SEßLACH","GLEISMUTHHAUSEN",473165,1358,""]
[null,"SEßLACH","HATTERSDORF",473165,1371,""]
[null,"SEßLACH","HEILGERSDORF",473165,1372,""]
[null,"SEßLACH","LECHENROTH",473165,1400,""]
[null,"SEßLACH","MERLACH",473165,1411,{"$f":"+IF(A7042<>\"\",1,\"\")","v":""}]
[null,"SEßLACH","OBERELLDORF",473165,1438,""]
[null,"SEßLACH","ROTHENBERG",473165,1462,""]
[null,"SEßLACH","SEßLACH",473165,1479,""]
[null,"SEßLACH","UNTERELLDORF",473165,1503,""]
[null,"SEßLACH","WITZMANNSBERG",473165,1528,""]
[null,"SEUBERSDORF I.D.OPF.","BATZHAUSEN",373160,5401,""]
[null,"SEUBERSDORF I.D.OPF.","EICHENHOFEN",373160,5402,""]
[null,"SEUBERSDORF I.D.OPF.","ITTELHOFEN",373160,5403,""]
[null,"SEUBERSDORF I.D.OPF.","SCHNUFENHOFEN",373160,5404,""]
[null,"SEUBERSDORF I.D.OPF.","SEUBERSDORF I.D.OPF.",373160,5405,""]
[null,"SEUBERSDORF I.D.OPF.","WISSING",373160,5406,""]
[null,"SEUBERSDORF I.D.OPF.","DAßWANG",373160,5407,""]
[null,"SEUKENDORF","SEUKENDORF",573126,3334,""]
[null,"SEYBOTHENREUTH","SEYBOTHENREUTH",472188,2459,""]
[null,"SEYBOTHENREUTH","SEYBOTHENREUTHER FORST",472188,2470,""]
[null,"SIEGENBURG","NIEDERUMELSDORF",273172,6065,""]
[null,"SIEGENBURG","SIEGENBURG",273172,6092,""]
[null,"SIEGENBURG","STAUDACH",273172,6093,""]
[null,"SIEGENBURG","TOLLBACH",273172,6100,""]
[null,"SIEGSDORF","HASLACH",189145,9851,""]
[null,"SIEGSDORF","HOCHBERG",189145,9853,""]
[null,"SIEGSDORF","UNTERSIEGSDORF",189145,9864,""]
[null,"SIEGSDORF","OBERSIEGSDORF",189145,9865,""]
[null,"SIEGSDORF","EISENÄRZT",189145,9866,""]
[null,"SIEGSDORF","VOGLING",189145,9867,""]
[null,"SIEGSDORF","HAMMER",189145,9868,""]
[null,"SIELENBACH","SIELENBACH",771165,7353,""]
[null,"SIELENBACH","TÖDTENRIED",771165,7354,""]
[null,"SIGMARSZELL","BÖSENREUTIN",776126,7942,""]
[null,"SIGMARSZELL","SIGMARSZELL",776126,7943,""]
[null,"SIGMARSZELL","NIEDERSTAUFEN",776126,7944,""]
[null,"SIMBACH","NIEDERHAUSEN",279135,6204,""]
[null,"SIMBACH","HAUNERSDORF",279135,6208,""]
[null,"SIMBACH","LANGGRABEN",279135,6209,""]
[null,"SIMBACH","PISCHELSDORF",279135,6210,""]
[null,"SIMBACH","RENGERSDORF II",279135,6211,""]
[null,"SIMBACH","RUHSTORF",279135,6212,""]
[null,"SIMBACH","SIMBACH",279135,6213,""]
[null,"SIMBACH A.INN","EGGSTETTEN",277145,6515,""]
[null,"SIMBACH A.INN","KIRCHBERG A.INN",277145,6516,""]
[null,"SIMBACH A.INN","SIMBACH A.INN",277145,6517,""]
[null,"SIMBACH A.INN","ERLACH",277145,6518,""]
[null,"SIMMELSDORF","DIEPOLTSDORF",574158,3514,""]
[null,"SIMMELSDORF","GROßENGSEE",574158,3523,""]
[null,"SIMMELSDORF","HÜTTENBACH",574158,3541,""]
[null,"SIMMELSDORF","OBERNDORF",574158,3555,""]
[null,"SIMMELSDORF","SIMMELSDORF",574158,3573,""]
[null,"SIMMELSDORF","UTZMANNSBACH",574158,3578,""]
[null,"SIMMELSDORF","WILDENFELS",574158,3586,""]
[null,"SIMMERSHOFEN","ADELHOFEN",575163,2901,""]
[null,"SIMMERSHOFEN","AUERNHOFEN",575163,2906,""]
[null,"SIMMERSHOFEN","EQUARHOFEN",575163,2939,""]
[null,"SIMMERSHOFEN","HOHLACH",575163,2973,""]
[null,"SIMMERSHOFEN","SIMMERSHOFEN",575163,3035,""]
[null,"SIMMERSHOFEN","WALKERSHOFEN",575163,3058,""]
[null,"SINDELSDORF","SINDELSDORF",190153,9231,""]
[null,"SINZING","BERGMATTING",375199,5209,""]
[null,"SINZING","EILSBRUNN",375199,5226,""]
[null,"SINZING","KLEINPRÜFENING",375199,5271,""]
[null,"SINZING","REICHENSTETTEN",375199,5315,""]
[null,"SINZING","SINZING",375199,5331,""]
[null,"SINZING","VIEHHAUSEN",375199,5344,""]
[null,"SÖCHTENAU","SÖCHTENAU",187174,9671,""]
[null,"SOLNHOFEN","SOLNHOFEN",577168,3769,{"$f":"+IF(A7106<>\"\",1,\"\")","v":""}]
[null,"SOLNHOFEN","EßLINGEN",577168,3770,""]
[null,"SOMMERACH","SOMMERACH",675169,1124,""]
[null,"SOMMERHAUSEN","SOMMERHAUSEN",679187,728,""]
[null,"SOMMERKAHL","SOMMERKAHL",671153,329,""]
[null,"SOMMERKAHL","SCHÖLLKRIPPENER FORST",671153,330,""]
[null,"SONDERHOFEN","SÄCHSENHEIM",679188,759,""]
[null,"SONDERHOFEN","SONDERHOFEN",679188,760,""]
[null,"SONDERHOFEN","BOLZHAUSEN",679188,761,""]
[null,"SONDHEIM V.D.RHÖN","STETTEN",673167,17,""]
[null,"SONDHEIM V.D.RHÖN","SONDHEIM V.D.RHÖN",673167,24,""]
[null,"SONNEFELD","BIEBERBACH",473166,1310,""]
[null,"SONNEFELD","GESTUNGSHAUSEN",473166,1357,""]
[null,"SONNEFELD","HASSENBERG",473166,1370,""]
[null,"SONNEFELD","NEUSES A.BRAND",473166,1430,""]
[null,"SONNEFELD","OBERWASUNGEN",473166,1447,""]
[null,"SONNEFELD","SONNEFELD",473166,1481,""]
[null,"SONNEFELD","SONNEFELDER FORST-NORD",473166,1482,""]
[null,"SONNEFELD","SONNEFELDER FORST-SÜD",473166,1483,""]
[null,"SONNEFELD","SONNEFELDER FORST-WEST",473166,1484,""]
[null,"SONNEFELD","WEICKENBACH",473166,1514,""]
[null,"SONNEFELD","WEISCHAU",473166,1519,""]
[null,"SONNEFELD","WÖRLSDORF",473166,1529,""]
[null,"SONNEFELD","ZEDERSDORF",473166,1534,""]
[null,"SONNEN","OBERNEUREUTH",275148,6318,""]
[null,"SONNEN","SONNEN",275148,6319,""]
[null,"SONNENWALD","SCHÖFWEG",272462,5829,""]
[null,"SONTHEIM","ATTENHAUSEN",778196,7563,""]
[null,"SONTHEIM","SONTHEIM",778196,7564,""]
[null,"SONTHOFEN","SONTHOFEN",780139,7981,""]
[null,"SONTHOFEN","ALTSTÄDTEN",780139,7982,""]
[null,"SOOS","LEERSTETTEN",576455,3860,""]
[null,"SOPHIENTHALER FORST","SOPHIENTHALER FORST",472466,2460,""]
[null,"SOYEN","SOYEN",187176,9751,""]
[null,"SOYEN","SCHLICHT",187176,9752,""]
[null,"SOYEN","BUCHSEE",187176,9753,""]
[null,"SPALT","ENDERNDORF AM SEE",576147,3821,""]
[null,"SPALT","FÜNFBRONN",576147,3826,""]
[null,"SPALT","GROßWEINGARTEN",576147,3833,""]
[null,"SPALT","MOSBACH",576147,3868,""]
[null,"SPALT","SPALT",576147,3904,""]
[null,"SPALT","WERNFELS",576147,3917,""]
[null,"SPARDORF","SPARDORF",572154,2834,""]
[null,"SPARNECK","SPARNECK",475174,1951,""]
[null,"SPARNECK","SPARNECKER FORST",475174,1986,""]
[null,"SPATZENHAUSEN","SPATZENHAUSEN",180133,9235,""]
[null,"SPEICHERSDORF","SEYBOTHENREUTH",472190,2459,""]
[null,"SPEICHERSDORF","SEYBOTHENREUTHER FORST",472190,2470,""]
[null,"SPEICHERSDORF","PREBITZ",472190,2497,""]
[null,"SPEICHERSDORF","GÖPPMANNSBÜHL A.BERG",472190,2501,""]
[null,"SPEICHERSDORF","ZEULENREUTH",472190,2502,""]
[null,"SPEICHERSDORF","HAIDENAAB",472190,2503,""]
[null,"SPEICHERSDORF","KIRCHENLAIBACH",472190,2504,""]
[null,"SPEICHERSDORF","SPEICHERSDORF",472190,2505,""]
[null,"SPEICHERSDORF","WIRBENZ",472190,2506,""]
[null,"SPEICHERSDORF","WINDISCHENLAIBACH",472190,2507,""]
[null,"SPEICHERSDORF","ROSLAS",472190,2508,""]
[null,"SPEICHERSDORF","NAIRITZ",472190,2509,""]
[null,"SPEICHERSDORF","PLÖSSEN",472190,2510,""]
[null,"SPEICHERSDORF","KODLITZ",472190,2511,""]
[null,"SPEICHERSDORF","RAMLESREUTH",472190,2512,""]
[null,"SPEICHERSDORF","GUTTENTHAU",472190,2513,""]
[null,"SPEICHERSDORF","PREBITZ - SPEICHERSDORF",472190,2558,""]
[null,"SPEINSHART","SPEINSHART",374157,4257,""]
[null,"SPEINSHART","SEITENTHAL",374157,4258,{"$f":"+IF(A7170<>\"\",1,\"\")","v":""}]
[null,"SPEINSHART","TREMMERSDORF",374157,4259,""]
[null,"SPEINSHARTER FORST","OBERBIBRACH",374458,4253,""]
[null,"SPEINSHARTER FORST","SPEINSHART",374458,4257,""]
[null,"SPIEGELAU","KLINGENBRUNN",272149,5802,""]
[null,"SPIEGELAU","OBERKREUZBERG",272149,5812,""]
[null,"ST. ENGLMAR","SANKT ENGLMAR",278184,5575,""]
[null,"ST. OSWALD-RIEDLHÜTT","SANKT OSWALD",272143,5803,""]
[null,"ST. WOLFGANG","TANN",177137,8404,""]
[null,"ST. WOLFGANG","LAPPACH",177137,8405,""]
[null,"ST. WOLFGANG","SANKT WOLFGANG",177137,8406,""]
[null,"ST. WOLFGANG","JEßLING",177137,8407,""]
[null,"ST. WOLFGANG","GATTERBERG",177137,8408,""]
[null,"ST. WOLFGANG","SCHÖNBRUNN",177137,8409,""]
[null,"ST. WOLFGANG","PYRAMOOS",177137,8414,""]
[null,"STADELHOFEN","HOHENHÄUSLING",471189,2193,""]
[null,"STADELHOFEN","SCHEDERNDORF",471189,2279,""]
[null,"STADELHOFEN","STADELHOFEN",471189,2290,""]
[null,"STADELHOFEN","STEINFELD",471189,2294,""]
[null,"STADELHOFEN","WÖLKENDORF",471189,2340,""]
[null,"STADLERN","STADLERN",376167,4850,""]
[null,"STADTBERGEN","STADTBERGEN",772202,7283,""]
[null,"STADTBERGEN","DEURINGEN",772202,7284,""]
[null,"STADTBERGEN","LEITERSHOFEN",772202,7285,""]
[null,"STADTLAURINGEN","OBERLAURINGEN",678181,801,""]
[null,"STADTLAURINGEN","MAILES",678181,803,""]
[null,"STADTLAURINGEN","WETZHAUSEN",678181,804,""]
[null,"STADTLAURINGEN","BIRNFELD",678181,805,""]
[null,"STADTLAURINGEN","STADTLAURINGEN",678181,808,""]
[null,"STADTLAURINGEN","SULZDORF",678181,809,""]
[null,"STADTLAURINGEN","ROTTENSTEINER FORST",678181,811,""]
[null,"STADTLAURINGEN","BALLINGSHAUSEN",678181,814,""]
[null,"STADTLAURINGEN","ALTENMÜNSTER",678181,815,""]
[null,"STADTLAURINGEN","FUCHSSTADT",678181,816,""]
[null,"STADTLAURINGEN","WETTRINGEN",678181,817,""]
[null,"STADTPROZELTEN","STADTPROZELTEN",676158,440,""]
[null,"STADTPROZELTEN","NEUENBUCH",676158,441,""]
[null,"STADTSTEINACH","SCHWAND",477156,1712,""]
[null,"STADTSTEINACH","ZAUBACH",477156,1713,""]
[null,"STADTSTEINACH","STADTSTEINACHER FORST",477156,1714,""]
[null,"STADTSTEINACH","TRIEBENREUTH",477156,1715,""]
[null,"STADTSTEINACH","STADTSTEINACH",477156,1716,""]
[null,"STADTSTEINACH","VOGTENDORF",477156,1717,""]
[null,"STAFFELSTEIN","ALTENBANZ",478165,1304,""]
[null,"STAFFELSTEIN","FRAUENDORF",478165,1349,""]
[null,"STAFFELSTEIN","GRUNDFELD",478165,1366,""]
[null,"STAFFELSTEIN","HORSDORF",478165,1380,""]
[null,"STAFFELSTEIN","NEDENSDORF",478165,1423,""]
[null,"STAFFELSTEIN","SCHÖNBRUNN",478165,1472,""]
[null,"STAFFELSTEIN","SCHWABTHAL",478165,1476,""]
[null,"STAFFELSTEIN","STADEL",478165,1486,""]
[null,"STAFFELSTEIN","STAFFELSTEIN",478165,1487,""]
[null,"STAFFELSTEIN","STUBLANG",478165,1490,""]
[null,"STAFFELSTEIN","UETZING",478165,1500,""]
[null,"STAFFELSTEIN","UNNERSDORF",478165,1501,""]
[null,"STAFFELSTEIN","UNTERZETTLITZ",478165,1510,""]
[null,"STAFFELSTEIN","WIESEN",478165,1525,""]
[null,"STAFFELSTEIN","WOLFSDORF",478165,1531,""]
[null,"STALLWANG","SCHÖNSTEIN",278189,5552,""]
[null,"STALLWANG","LANDORF",278189,5557,""]
[null,"STALLWANG","STALLWANG",278189,5565,""]
[null,"STAMMBACH","STRAAS",475175,1941,""]
[null,"STAMMBACH","GUNDLITZ",475175,1942,""]
[null,"STAMMBACH","STAMMBACH",475175,1943,""]
[null,"STAMMBACH","FLEISNITZ",475175,1944,{"$f":"+IF(A7234<>\"\",1,\"\")","v":""}]
[null,"STAMMBACH","FÖRSTENREUTH",475175,1945,""]
[null,"STAMMHAM (LKR. AÖ)","Stammham",171130,8935,""]
[null,"STAMMHAM (LKR. EI)","KÖSCHINGER FORST",176161,8019,""]
[null,"STAMMHAM (LKR. EI)","NEUHAU",176161,8020,""]
[null,"STAMMHAM (LKR. EI)","APPERTSHOFEN",176161,8021,""]
[null,"STAMMHAM (LKR. EI)","STAMMHAM",176161,8022,""]
[null,"STAMMHAM (LKR. EI)","WESTERHOFEN",176161,8023,""]
[null,"STAMSRIED","GROßENZENRIED",372161,5029,""]
[null,"STAMSRIED","DIEBERSRIED",372161,5030,""]
[null,"STAMSRIED","FRIEDERSRIED",372161,5031,""]
[null,"STAMSRIED","STAMSRIED",372161,5032,""]
[null,"STAMSRIED","ASBACH",372161,5033,""]
[null,"STAMSRIED","HITZELSBERG",372161,5034,""]
[null,"STAMSRIED","KOLLENZENDORF",372161,5035,""]
[null,"STARNBERG","HADORF",188139,9172,""]
[null,"STARNBERG","HANFELD",188139,9173,""]
[null,"STARNBERG","LEUTSTETTEN",188139,9174,""]
[null,"STARNBERG","WANGEN",188139,9175,""]
[null,"STARNBERG","PERCHTING",188139,9179,""]
[null,"STARNBERG","SÖCKING",188139,9180,""]
[null,"STARNBERG","STARNBERG",188139,9181,""]
[null,"STARNBERG","PERCHA",188139,9182,""]
[null,"STARNBERG","LANDSTETTEN",188139,9184,""]
[null,"STARNBERGER SEE","STARNBERGER SEE",188451,9197,""]
[null,"STAUDACH-EGERNDACH","STAUDACH-EGERNDACH",189146,9859,""]
[null,"STEGAURACH","BIRKACHER WALD",471191,2112,""]
[null,"STEGAURACH","HARTLANDEN",471191,2180,""]
[null,"STEGAURACH","HÖFEN",471191,2191,""]
[null,"STEGAURACH","MÜHLENDORF",471191,2233,""]
[null,"STEGAURACH","STEGAURACH",471191,2293,""]
[null,"STEIN","STEIN",573127,3362,""]
[null,"STEIN","GUTZBERG",573127,3363,""]
[null,"STEINACH","MÜNSTER",278190,5587,""]
[null,"STEINACH","STEINACH",278190,5595,""]
[null,"STEINACH","AGENDORF",278190,5596,""]
[null,"STEINACHER FORST R.D.SAALE","STEINACHER FORST R.D.SAALE",673456,77,""]
[null,"STEINACHER FORST R.D.SAALE","STEINACH - GEMEINDEFREI",673456,150,""]
[null,"STEINACHSRANGEN","UNTERSTEINACH",471460,2322,""]
[null,"STEINBACH A.WALD","KEHLBACH",476175,1559,""]
[null,"STEINBACH A.WALD","WINDHEIM",476175,1561,""]
[null,"STEINBACH A.WALD","STEINBACH A.WALD",476175,1562,""]
[null,"STEINBACH A.WALD","BUCHBACH",476175,1563,""]
[null,"STEINBACH A.WALD","HIRSCHFELD",476175,1564,""]
[null,"STEINBERG (LKR. KC)","STEINBERG",476454,1586,""]
[null,"STEINBERG (LKR. SAD)","ODER",376168,4769,""]
[null,"STEINBERG (LKR. SAD)","STEINBERG",376168,4770,""]
[null,"STEINDORF","STEINDORF",771168,7397,""]
[null,"STEINDORF","HAUSEN B.HOFHEGNENBERG",771168,7398,""]
[null,"STEINDORF","HOFHEGNENBERG",771168,7399,""]
[null,"STEINDORF","ERESRIED",771168,7400,""]
[null,"STEINFELD","HAUSEN",677186,563,""]
[null,"STEINFELD","STEINFELD",677186,564,""]
[null,"STEINFELD","WALDZELL",677186,578,""]
[null,"STEINGADEN","FRONREITEN",190154,9088,""]
[null,"STEINGADEN","LAUTERBACH",190154,9091,""]
[null,"STEINGADEN","URSPRING",190154,9102,""]
[null,"STEINHÖRING","STEINHÖRING",175137,8778,""]
[null,"STEINHÖRING","SANKT CHRISTOPH",175137,8781,""]
[null,"STEINKIRCHEN","STEINKIRCHEN",177138,8359,""]
[null,"STEINKIRCHEN","HOFSTARRING",177138,8360,""]
[null,"STEINSFELD","BETTWAR",571205,2913,""]
[null,"STEINSFELD","ENDSEE",571205,2938,""]
[null,"STEINSFELD","GATTENHOFEN",571205,2952,""]
[null,"STEINSFELD","HARTERSHOFEN",571205,2965,{"$f":"+IF(A7298<>\"\",1,\"\")","v":""}]
[null,"STEINSFELD","STEINSFELD",571205,3039,""]
[null,"STEINWIESEN","TSCHIRN",476177,1570,""]
[null,"STEINWIESEN","EFFELTER",476177,1581,""]
[null,"STEINWIESEN","BIRNBAUM",476177,1592,""]
[null,"STEINWIESEN","NURN",476177,1593,""]
[null,"STEINWIESEN","NEUFANG",476177,1594,""]
[null,"STEINWIESEN","STEINWIESEN",476177,1595,""]
[null,"STEPHANSKIRCHEN","STEPHANSKIRCHEN",187177,9674,""]
[null,"STEPHANSPOSCHING","STEINKIRCHEN",271151,5928,""]
[null,"STEPHANSPOSCHING","MICHAELSBUCH",271151,5929,""]
[null,"STEPHANSPOSCHING","STEPHANSPOSCHING",271151,5930,""]
[null,"STEPHANSPOSCHING","ROTTERSDORF",271151,5931,""]
[null,"STETTEN","STETTEN",778199,7792,""]
[null,"STETTEN","ERISRIED",778199,7793,""]
[null,"STETTFELD","STETTFELD",674201,994,""]
[null,"STIEFENHOFEN","HARBATSHOFEN",776127,7958,""]
[null,"STIEFENHOFEN","STIEFENHOFEN",776127,7959,""]
[null,"STOCKHEIM (LKR. KC)","NEUKENROTH",476178,1596,""]
[null,"STOCKHEIM (LKR. KC)","STOCKHEIM",476178,1597,""]
[null,"STOCKHEIM (LKR. KC)","WOLFERSDORF",476178,1598,""]
[null,"STOCKHEIM (LKR. KC)","BURGGRUB",476178,1599,""]
[null,"STOCKHEIM (LKR. KC)","REITSCH",476178,1600,""]
[null,"STOCKHEIM (LKR. KC)","HAßLACH B.KRONACH",476178,1601,""]
[null,"STOCKHEIM (LKR. KC)","HAIG",476178,1602,""]
[null,"STOCKHEIM (LKR. NES)","STOCKHEIM",673170,26,""]
[null,"STOCKSTADT A.MAIN","STOCKSTADT A.MAIN",671155,361,""]
[null,"STOFFENRIEDER FORST","STOFFENRIEDER FORST",775454,7101,""]
[null,"STOLLBERGER FORST","HANDTHAL",678455,1059,""]
[null,"STÖRNSTEIN","LANZ",374158,4319,""]
[null,"STÖRNSTEIN","STÖRNSTEIN",374158,4320,""]
[null,"STÖTTEN A.AUERBERG","REMNATSRIED",777171,7891,""]
[null,"STÖTTEN A.AUERBERG","STÖTTEN A.AUERBERG",777171,7892,""]
[null,"STÖTTEN A.AUERBERG","STEINBACH",777171,7893,""]
[null,"STÖTTWANG","LINDEN",777172,7861,""]
[null,"STÖTTWANG","THALHOFEN A.D.GENNACH",777172,7862,""]
[null,"STÖTTWANG","STÖTTWANG",777172,7863,""]
[null,"STÖTTWANG","REICHENBACH",777172,7864,""]
[null,"STRAHLUNGEN","STRAHLUNGEN",673171,111,""]
[null,"STRAßKIRCHEN","SCHAMBACH",278192,5641,""]
[null,"STRAßKIRCHEN","STRAßKIRCHEN",278192,5646,""]
[null,"STRAßKIRCHEN","PAITZKOFEN",278192,5658,""]
[null,"STRAßKIRCHEN","GRAFLING",278192,5669,""]
[null,"STRAßLACH","STRAßLACH",184144,9303,""]
[null,"STRAßLACH","DINGHARTING",184144,9304,""]
[null,"STRAUBING","UNTERZEITLDORN",263000,5612,""]
[null,"STRAUBING","KAGERS",263000,5622,""]
[null,"STRAUBING","HORNSTORF",263000,5623,""]
[null,"STRAUBING","ALBURG",263000,5624,""]
[null,"STRAUBING","STRAUBING",263000,5625,""]
[null,"STRAUBING","ITTLING",263000,5626,""]
[null,"STRULLENDORF","AMLINGSTADT",471195,2105,""]
[null,"STRULLENDORF","GEISBERGER FORST",471195,2163,""]
[null,"STRULLENDORF","GEISFELD",471195,2164,""]
[null,"STRULLENDORF","HAUPTSMOOR",471195,2184,""]
[null,"STRULLENDORF","LEESTEN",471195,2211,""]
[null,"STRULLENDORF","MISTENDORF",471195,2230,""]
[null,"STRULLENDORF","ROßDORF A.FORST",471195,2272,""]
[null,"STRULLENDORF","STRULLENDORF",471195,2299,""]
[null,"STRULLENDORF","WERNSDORF",471195,2336,""]
[null,"STRULLENDORF","ZEEGENDORF",471195,2345,""]
[null,"STUBENBERG","STUBENBERG",277147,6512,""]
[null,"STULLN","STULLN",376169,4872,""]
[null,"SÜDL.STEINWALD","TREVESEN",377457,4212,""]
[null,"SUGENHEIM","NEUNDORF",575165,1242,{"$f":"+IF(A7362<>\"\",1,\"\")","v":""}]
[null,"SUGENHEIM","KRASSOLZHEIM",575165,1247,""]
[null,"SUGENHEIM","INGOLSTADT",575165,1248,""]
[null,"SUGENHEIM","EZELHEIM",575165,1249,""]
[null,"SUGENHEIM","KRAUTOSTHEIM",575165,1250,""]
[null,"SUGENHEIM","DEUTENHEIM",575165,1251,""]
[null,"SUGENHEIM","SUGENHEIM",575165,1252,""]
[null,"SUGENHEIM","ULLSTADT",575165,1253,""]
[null,"SULZBACH A.MAIN","Sulzbach a.Main",676160,402,""]
[null,"SULZBACH A.MAIN","SODEN",676160,403,""]
[null,"SULZBACH A.MAIN","DORNAU",676160,407,""]
[null,"SULZBACH-ROSENBERG","RÖCKENRICHT",371151,4482,""]
[null,"SULZBACH-ROSENBERG","GROßALBERSHOF",371151,4483,""]
[null,"SULZBACH-ROSENBERG","TRONDORF",371151,4497,""]
[null,"SULZBACH-ROSENBERG","SULZBACH",371151,4498,""]
[null,"SULZBACH-ROSENBERG","ROSENBERG",371151,4499,""]
[null,"SULZBACH-ROSENBERG","KÖTZERSRICHT",371151,4500,""]
[null,"SULZBACH-ROSENBERG","ANGFELD",371151,4508,""]
[null,"SULZBACH-ROSENBERG","POPPENRICHT",371151,4510,""]
[null,"SULZBERG","SULZBERG",780140,7684,""]
[null,"SULZBERG","OTTACKER",780140,7685,""]
[null,"SULZBERG","MOOSBACH",780140,7686,""]
[null,"SULZDORF A.D.LEDERHE","OBEREßFELD",673172,118,""]
[null,"SULZDORF A.D.LEDERHE","STERNBERG I.GRABFELD",673172,119,""]
[null,"SULZDORF A.D.LEDERHE","ZIMMERAU",673172,120,""]
[null,"SULZDORF A.D.LEDERHE","SULZDORF A.D.LEDERHECKE",673172,124,""]
[null,"SULZDORF A.D.LEDERHE","SCHWANHAUSEN",673172,125,""]
[null,"SULZDORF A.D.LEDERHE","SERRFELD",673172,126,""]
[null,"SULZEMOOS","WIEDENZHAUSEN",174146,8555,""]
[null,"SULZEMOOS","EINSBACH",174146,8610,""]
[null,"SULZEMOOS","SULZEMOOS",174146,8647,""]
[null,"SULZFELD","KLEINBARDORF",673173,106,""]
[null,"SULZFELD","SULZFELD",673173,113,""]
[null,"SULZFELD","LEINACH",673173,121,""]
[null,"SULZFELD","SULZFELDER FORST",673173,122,""]
[null,"SULZFELD A.MAIN","SULZFELD A.MAIN",675170,1180,""]
[null,"SULZFELDER FORST","SULZFELDER FORST",673457,122,""]
[null,"SULZHEIM","SULZHEIM",678183,1003,""]
[null,"SULZHEIM","ALITZHEIM",678183,1018,""]
[null,"SULZHEIM","MÖNCHSTOCKHEIM",678183,1019,""]
[null,"SULZHEIM","VÖGNITZ",678183,1020,""]
[null,"SULZTHAL","SULZTHAL",672155,288,""]
[null,"SÜNCHING","HAIDENKOFEN",375201,5253,""]
[null,"SÜNCHING","SÜNCHING",375201,5335,""]
[null,"SURBERG","SURBERG",189148,9854,""]
[null,"SURBERG","LAUTER",189148,9855,""]
[null,"SYRGENSTEIN","STAUFEN",773170,6835,""]
[null,"SYRGENSTEIN","SYRGENSTEIN",773170,6836,""]
[null,"SYRGENSTEIN","LANDSHAUSEN",773170,6837,""]
[null,"TACHERTING","PETERSKIRCHEN",189149,9807,""]
[null,"TACHERTING","EMERTSHAM",189149,9808,""]
[null,"TACHERTING","TACHERTING",189149,9809,""]
[null,"TACHING A.SEE","TENGLING",189150,9909,""]
[null,"TACHING A.SEE","TACHING A.SEE",189150,9910,""]
[null,"TAGMERSHEIM","TAGMERSHEIM",779217,6917,""]
[null,"TAGMERSHEIM","BLOSSENAU",779217,6918,""]
[null,"TANN","WALBURGSKIRCHEN",277148,6501,""]
[null,"TANN","ZIMMERN",277148,6502,""]
[null,"TANN","TANN",277148,6503,""]
[null,"TÄNNESBERG","ETZGERSRIETH",374159,4378,""]
[null,"TÄNNESBERG","DÖLLNITZ",374159,4408,""]
[null,"TÄNNESBERG","WOPPENRIETH",374159,4409,""]
[null,"TÄNNESBERG","KLEINSCHWAND",374159,4410,""]
[null,"TÄNNESBERG","GROßENSCHWAND",374159,4411,""]
[null,"TÄNNESBERG","TÄNNESBERG",374159,4412,{"$f":"+IF(A7426<>\"\",1,\"\")","v":""}]
[null,"TAPFHEIM","ZUSUM",779218,6953,""]
[null,"TAPFHEIM","OPPERTSHOFEN",779218,6955,""]
[null,"TAPFHEIM","BRACHSTADT",779218,6956,""]
[null,"TAPFHEIM","ERLINGSHOFEN",779218,6957,""]
[null,"TAPFHEIM","TAPFHEIM",779218,6958,""]
[null,"TAPFHEIM","RETTINGEN",779218,7039,""]
[null,"TAUBERRETTERSHEIM","TAUBERRETTERSHEIM",679192,777,""]
[null,"TAUFKIRCHEN (LKR. M)","TAUFKIRCHEN",184145,8705,""]
[null,"TAUFKIRCHEN (LKR. MÜ)","TAUFKIRCHEN",183145,8859,""]
[null,"TAUFKIRCHEN (LKR. MÜ)","ZEILING",183145,8860,""]
[null,"TAUFKIRCHEN A.D.VILS","WAMBACH",177139,8362,""]
[null,"TAUFKIRCHEN A.D.VILS","TAUFKIRCHEN (VILS)",177139,8366,""]
[null,"TAUFKIRCHEN A.D.VILS","HUBENSTEIN",177139,8367,""]
[null,"TAUFKIRCHEN A.D.VILS","MOOSEN (VILS)",177139,8368,""]
[null,"TAUFKIRCHEN A.D.VILS","GEBENSBACH",177139,8369,""]
[null,"TAUFKIRCHEN A.D.VILS","HOFKIRCHEN",177139,8376,""]
[null,"TAUFKIRCHEN A.D.VILS","EIBACH",177139,8377,""]
[null,"TEGERNHEIM","TEGERNHEIM",375204,5338,""]
[null,"TEGERNSEE","TEGERNSEE",182132,9424,""]
[null,"TEISENDORF","RÜCKSTETTEN",172134,9924,""]
[null,"TEISENDORF","HOLZHAUSEN B.TEISENDORF",172134,9925,""]
[null,"TEISENDORF","WEILDORF",172134,9926,""]
[null,"TEISENDORF","OBERTEISENDORF",172134,9927,""]
[null,"TEISENDORF","TEISENDORF",172134,9928,""]
[null,"TEISENDORF","NEUKIRCHEN A.TEISENBERG",172134,9929,""]
[null,"TEISENDORF","FREIDLING",172134,9930,""]
[null,"TEISENDORF","ROßDORF",172134,9931,""]
[null,"TEISING","TEISING",171131,8936,""]
[null,"TEISNACH","TEISNACH",276143,5728,""]
[null,"TETTAU","TETTAU",476179,1557,""]
[null,"TETTAU","KLEINTETTAU",476179,1558,""]
[null,"TETTAU","LANGENAU",476179,1560,""]
[null,"TETTENWEIS","OBERSCHWÄRZENBACH",275149,6382,""]
[null,"TETTENWEIS","TETTENWEIS",275149,6383,""]
[null,"TETTENWEIS","POIGHAM",275149,6384,""]
[null,"TEUBLITZ","KATZDORF",376170,4774,""]
[null,"TEUBLITZ","PREMBERG",376170,4777,""]
[null,"TEUBLITZ","MÜNCHSHOFEN",376170,4778,""]
[null,"TEUBLITZ","SALTENDORF A.D.NAAB",376170,4779,""]
[null,"TEUBLITZ","TEUBLITZ",376170,4780,""]
[null,"TEUBLITZ","SAMSBACHER FORST",376170,4790,""]
[null,"TEUGN","TEUGN",273175,6098,""]
[null,"TEUNZ","WILDSTEIN",376171,4820,""]
[null,"TEUNZ","ZEINRIED",376171,4821,""]
[null,"TEUNZ","FUCHSBERG",376171,4822,""]
[null,"TEUNZ","TEUNZ",376171,4823,""]
[null,"TEUSCHNITZ","HAßLACH",476180,1565,""]
[null,"TEUSCHNITZ","TEUSCHNITZ",476180,1567,""]
[null,"TEUSCHNITZ","RAPPOLTENGRÜN",476180,1568,""]
[null,"TEUSCHNITZ","WICKENDORF",476180,1569,""]
[null,"THAINING","THAINING",181142,9066,""]
[null,"THALMASSING","LUCKENPAINT",375205,5282,""]
[null,"THALMASSING","SANDING",375205,5321,""]
[null,"THALMASSING","THALMASSING",375205,5339,""]
[null,"THALMASSING","WEILLOHE",375205,5348,""]
[null,"THALMASSING","WOLKERING",375205,5355,""]
[null,"THALMÄSSING","ABERZHAUSEN",576148,3803,""]
[null,"THALMÄSSING","ALFERSHAUSEN",576148,3804,""]
[null,"THALMÄSSING","AUE",576148,3807,""]
[null,"THALMÄSSING","DIXENHAUSEN",576148,3816,""]
[null,"THALMÄSSING","EYSÖLDEN",576148,3824,""]
[null,"THALMÄSSING","HAGENICH",576148,3837,""]
[null,"THALMÄSSING","KLEINHÖBING",576148,3850,""]
[null,"THALMÄSSING","LANDERSDORF",576148,3857,{"$f":"+IF(A7490<>\"\",1,\"\")","v":""}]
[null,"THALMÄSSING","LOHEN",576148,3862,""]
[null,"THALMÄSSING","OFFENBAU",576148,3873,""]
[null,"THALMÄSSING","OHLANGEN",576148,3874,""]
[null,"THALMÄSSING","PYRAS",576148,3882,""]
[null,"THALMÄSSING","REINWARZHOFEN",576148,3886,""]
[null,"THALMÄSSING","RUPPMANNSBURG",576148,3895,""]
[null,"THALMÄSSING","SCHWIMBACH",576148,3900,""]
[null,"THALMÄSSING","STAUF",576148,3905,""]
[null,"THALMÄSSING","THALMÄSSING",576148,3906,""]
[null,"THALMÄSSING","TIEFENBACH",576148,3908,""]
[null,"THALMÄSSING","WAIZENHOFEN",576148,3911,""]
[null,"THANNHAUSEN","THANNHAUSEN",774185,7726,""]
[null,"THANNHAUSEN","BURG",774185,7727,""]
[null,"THANSTEIN","WEISLITZ",376172,4910,""]
[null,"THANSTEIN","THANSTEIN",376172,4911,""]
[null,"THANSTEIN","BERG",376172,4912,""]
[null,"THANSTEIN","DAUTERSDORF",376172,4913,""]
[null,"THANSTEIN","KULZ",376172,4914,""]
[null,"THEILENHOFEN","DORNHAUSEN",577172,3625,""]
[null,"THEILENHOFEN","WACHSTEIN",577172,3626,""]
[null,"THEILENHOFEN","THEILENHOFEN",577172,3627,""]
[null,"THEILENHOFEN","GUNDELSHEIM A.D.ALTMÜHL",577172,3628,""]
[null,"THEILHEIM","THEILHEIM",679193,710,""]
[null,"THEISSEIL","ROSCHAU",374160,4321,""]
[null,"THEISSEIL","EDELDORF",374160,4322,""]
[null,"THEISSEIL","LETZAU",374160,4323,""]
[null,"THERES","BUCH",674180,896,""]
[null,"THERES","UNTERTHERES",674180,938,""]
[null,"THERES","HORHAUSEN",674180,939,""]
[null,"THERES","OBERTHERES",674180,940,""]
[null,"THIERHAUPTEN","THIERHAUPTEN",772207,6993,""]
[null,"THIERHAUPTEN","NEUKIRCHEN",772207,6995,""]
[null,"THIERHAUPTEN","EDENHAUSER FORST",772207,7001,""]
[null,"THIERSHEIM","KOTHIGENBIBERSBACH",479158,2043,""]
[null,"THIERSHEIM","THIERSHEIM",479158,2053,""]
[null,"THIERSHEIM","GRAFENREUTH",479158,2054,""]
[null,"THIERSHEIM","STEMMAS",479158,2055,""]
[null,"THIERSTEIN","KAISERHAMMER FORST-WEST",479159,2026,""]
[null,"THIERSTEIN","SCHWARZENHAMMER",479159,2033,""]
[null,"THIERSTEIN","THIERSTEIN",479159,2035,""]
[null,"THIERSTEIN","BIRKENBÜHL",479159,2036,""]
[null,"THIERSTEIN","HENDELHAMMER",479159,2037,""]
[null,"THUNDORF I.UFR.","THEINFELD",672157,242,""]
[null,"THUNDORF I.UFR.","THUNDORF I.UFR.",672157,256,""]
[null,"THUNDORF I.UFR.","ROTHHAUSEN",672157,274,""]
[null,"THÜNGEN","THÜNGEN",677189,655,""]
[null,"THÜNGERSHEIM","THÜNGERSHEIM",679194,666,""]
[null,"THURMANSBANG","SOLLA",272150,5837,""]
[null,"THURMANSBANG","THURMANSBANG",272150,5854,""]
[null,"THURNAU","HUTSCHDORF",477157,1790,""]
[null,"THURNAU","THURNAU",477157,1791,""]
[null,"THURNAU","MENCHAU",477157,1792,""]
[null,"THURNAU","BERNDORF",477157,1793,""]
[null,"THURNAU","LIMMERSDORF I",477157,1794,""]
[null,"THURNAU","LIMMERSDORF II",477157,1795,""]
[null,"THURNAU","LIMMERSDORF III",477157,1796,""]
[null,"THURNAU","FELKENDORF",477157,1797,""]
[null,"THURNAU","TANNFELD",477157,1798,""]
[null,"THURNAU","ALLADORF",477157,1799,""]
[null,"THURNAU","LIMMERSDORFER FORST",477157,1800,""]
[null,"THYRNAU","DONAUWETZDORF",275150,6330,""]
[null,"THYRNAU","THYRNAU",275150,6331,""]
[null,"THYRNAU","KELLBERG",275150,6332,""]
[null,"TIEFENBACH (LKR. CHA)","SCHÖNAU",372163,5001,{"$f":"+IF(A7554<>\"\",1,\"\")","v":""}]
[null,"TIEFENBACH (LKR. CHA)","HANNESRIED",372163,5002,""]
[null,"TIEFENBACH (LKR. CHA)","BREITENRIED",372163,5003,""]
[null,"TIEFENBACH (LKR. CHA)","STEINLOHE",372163,5004,""]
[null,"TIEFENBACH (LKR. CHA)","ALTENSCHNEEBERG",372163,5005,""]
[null,"TIEFENBACH (LKR. CHA)","TIEFENBACH",372163,5006,""]
[null,"TIEFENBACH (LKR. CHA)","IRLACH",372163,5007,""]
[null,"TIEFENBACH (LKR. CHA)","KATZELSRIED",372163,5008,""]
[null,"TIEFENBACH (LKR. LA)","TIEFENBACH",274182,6642,""]
[null,"TIEFENBACH (LKR. LA)","AST",274182,6643,""]
[null,"TIEFENBACH (LKR. LA)","MÜNCHSDORF",274182,6644,""]
[null,"TIEFENBACH (LKR. PA)","HASELBACH",275151,6325,""]
[null,"TIEFENBACH (LKR. PA)","KIRCHBERG",275151,6326,""]
[null,"TIEFENBACH (LKR. PA)","TIEFENBACH",275151,6327,""]
[null,"TIRSCHENREUTH","GUMPEN",377154,4131,""]
[null,"TIRSCHENREUTH","ROSALL",377154,4144,""]
[null,"TIRSCHENREUTH","WONDREB",377154,4145,""]
[null,"TIRSCHENREUTH","PILMERSREUTH A.WALD",377154,4146,""]
[null,"TIRSCHENREUTH","GROßKLENAU",377154,4147,""]
[null,"TIRSCHENREUTH","HOHENWALD",377154,4148,""]
[null,"TIRSCHENREUTH","TIRSCHENREUTH",377154,4149,""]
[null,"TIRSCHENREUTH","MATZERSREUTH",377154,4150,""]
[null,"TIRSCHENREUTH","LENGENFELD B.TIRSCHENREUTH",377154,4151,""]
[null,"TIRSCHENREUTH","GROßKONREUTH",377154,4152,""]
[null,"TIRSCHENREUTH","SCHWARZENBACH",377154,4156,""]
[null,"TIRSCHENREUTH","LIEBENSTEIN",377154,4161,""]
[null,"TIRSCHENREUTH","BEIDL",377154,4164,""]
[null,"TIRSCHENREUTH","TIRSCHENREUTH, BERGWERKE",377154,4168,""]
[null,"TITTING","GROßNOTTERSDORF",176164,3967,""]
[null,"TITTING","STADELHOFEN",176164,3968,""]
[null,"TITTING","MANTLACH",176164,3969,""]
[null,"TITTING","MORSBACH",176164,3970,""]
[null,"TITTING","KESSELBERG",176164,3971,""]
[null,"TITTING","TITTING",176164,3972,""]
[null,"TITTING","EMSING",176164,3973,""]
[null,"TITTING","ALTDORF",176164,3974,""]
[null,"TITTING","KALDORF",176164,3975,""]
[null,"TITTING","ERKERTSHOFEN",176164,3976,""]
[null,"TITTING","PETERSBUCH",176164,3977,""]
[null,"TITTLING","TITTLING",275152,6302,""]
[null,"TITTMONING","ASTEN",189152,9904,""]
[null,"TITTMONING","TITTMONING",189152,9905,""]
[null,"TITTMONING","KAY",189152,9906,""]
[null,"TITTMONING","KIRCHHEIM",189152,9907,""]
[null,"TITTMONING","TÖRRING",189152,9908,""]
[null,"TODTENWEIS","TODTENWEIS",771169,7417,""]
[null,"TÖGING A.INN","TÖGING A.INN",171132,8937,""]
[null,"TÖPEN","TÖPEN",475181,1878,""]
[null,"TÖPEN","ISAAR",475181,1879,""]
[null,"TRABITZ","PREIßACH",374148,4263,""]
[null,"TRABITZ","PICHLBERG",374148,4264,""]
[null,"TRABITZ","FEILERSDORF",374148,4265,""]
[null,"TRABITZ","WEIHERSBERG",374148,4266,""]
[null,"TRAIN","MALLMERSDORF",273177,6053,""]
[null,"TRAIN","STAUDACH",273177,6093,""]
[null,"TRAIN","TRAIN",273177,6101,""]
[null,"TRAITSCHING","VILZING",372164,5097,""]
[null,"TRAITSCHING","LOIFLING",372164,5147,""]
[null,"TRAITSCHING","TRAITSCHING",372164,5148,""]
[null,"TRAITSCHING","SATTELPEILNSTEIN",372164,5149,""]
[null,"TRAITSCHING","OBERGOßZELL",372164,5150,""]
[null,"TRAITSCHING","SATTELBOGEN",372164,5151,""]
[null,"TRAITSCHING","ATZENZELL",372164,5152,""]
[null,"TRAITSCHING","BIRNBRUNN",372164,5153,""]
[null,"TRAPPSTADT","TRAPPSTADT",673174,100,{"$f":"+IF(A7618<>\"\",1,\"\")","v":""}]
[null,"TRAPPSTADT","ALSLEBEN",673174,108,""]
[null,"TRAUNREUT","HAßMONING",189154,9828,""]
[null,"TRAUNREUT","STEIN A.D.TRAUN",189154,9829,""]
[null,"TRAUNREUT","TRAUNREUT",189154,9830,""]
[null,"TRAUNREUT","PIERLING",189154,9831,""]
[null,"TRAUNREUT","MATZING",189154,9832,""]
[null,"TRAUNREUT","TRAUNWALCHEN",189154,9833,""]
[null,"TRAUNSTEIN","WOLKERSDORF",189155,9848,""]
[null,"TRAUNSTEIN","KAMMER",189155,9849,""]
[null,"TRAUNSTEIN","TRAUNSTEIN",189155,9850,""]
[null,"TRAUNSTEIN","HASLACH",189155,9851,""]
[null,"TRAUNSTEIN","AU",189155,9852,""]
[null,"TRAUNSTEIN","HOCHBERG",189155,9853,""]
[null,"TRAUSNITZ","SÖLLITZ",376173,4809,""]
[null,"TRAUSNITZ","TRAUSNITZ",376173,4810,""]
[null,"TRAUTSKIRCHEN","TRAUTSKIRCHEN",575166,3315,""]
[null,"TRAUTSKIRCHEN","BUCH",575166,3316,""]
[null,"TREBGAST","TREBGASTER FORST",477158,1766,""]
[null,"TREBGAST","LINDAU",477158,1767,""]
[null,"TREBGAST","TREBGAST",477158,1768,""]
[null,"TREFFELSTEIN","STEINLOHE",372165,5004,""]
[null,"TREFFELSTEIN","TREFFELSTEIN",372165,5009,""]
[null,"TREFFELSTEIN","BIBERBACH",372165,5010,""]
[null,"TREUCHTLINGEN","WETTELSHEIM",577173,3744,""]
[null,"TREUCHTLINGEN","BUBENHEIM",577173,3745,""]
[null,"TREUCHTLINGEN","GRÖNHART",577173,3746,""]
[null,"TREUCHTLINGEN","GRABEN",577173,3747,""]
[null,"TREUCHTLINGEN","AUERNHEIM",577173,3748,""]
[null,"TREUCHTLINGEN","WINDISCHHAUSEN",577173,3749,""]
[null,"TREUCHTLINGEN","TREUCHTLINGEN",577173,3750,""]
[null,"TREUCHTLINGEN","SCHAMBACH",577173,3751,""]
[null,"TREUCHTLINGEN","MÖHREN",577173,3752,""]
[null,"TREUCHTLINGEN","HAAG B.TREUCHTLINGEN",577173,3753,""]
[null,"TREUCHTLINGEN","DIETFURT I.MFR.",577173,3754,""]
[null,"TREUCHTLINGEN","GUNDELSHEIM",577173,3755,""]
[null,"TRIEFENSTEIN","RETTERSHEIM",677154,609,""]
[null,"TRIEFENSTEIN","LENGFURT",677154,610,""]
[null,"TRIEFENSTEIN","TRENNFELD",677154,613,""]
[null,"TRIEFENSTEIN","HOMBURG A.MAIN",677154,614,""]
[null,"TRIFTERN","LENGSHAM",277149,6432,""]
[null,"TRIFTERN","ANZENKIRCHEN",277149,6434,""]
[null,"TRIFTERN","NEUKIRCHEN",277149,6445,""]
[null,"TRIFTERN","TRIFTERN",277149,6470,""]
[null,"TRIFTERN","VOGLARN",277149,6477,""]
[null,"TRIFTERN","WIESING",277149,6483,""]
[null,"TROGEN","TROGEN",475182,1883,""]
[null,"TRÖSTAU","NEUBAUER FORST-SÜD",479161,2059,""]
[null,"TRÖSTAU","TRÖSTAUER FORST-WEST",479161,2060,""]
[null,"TRÖSTAU","VORDORF",479161,2062,""]
[null,"TRÖSTAU","TRÖSTAU",479161,2063,""]
[null,"TRÖSTAU","NAGEL",479161,2064,""]
[null,"TRÖSTAUER FORST-OST","TRÖSTAUER FORST-OST",479459,2061,""]
[null,"TRÖSTAUER FORST-WEST","TRÖSTAUER FORST-WEST",479460,2060,""]
[null,"TROSTBERG","OBERFELDKIRCHEN",189157,9817,""]
[null,"TROSTBERG","TROSTBERG",189157,9818,""]
[null,"TROSTBERG","HEILIGKREUZ",189157,9819,""]
[null,"TROSTBERG","LINDACH",189157,9820,""]
[null,"TRUNKELSBERG","TRUNKELSBERG",778202,7574,""]
[null,"TSCHIRN","TSCHIRN",476455,1570,""]
[null,"TSCHIRN (LKR. KC)","TSCHIRN",476182,1570,""]
[null,"TUCHENBACH","TUCHENBACH",573129,3331,""]
[null,"TUNTENHAUSEN","BEYHARTING",187179,9606,""]
[null,"TUNTENHAUSEN","HOHENTHANN",187179,9640,""]
[null,"TUNTENHAUSEN","TUNTENHAUSEN",187179,9677,{"$f":"+IF(A7682<>\"\",1,\"\")","v":""}]
[null,"TUNTENHAUSEN","LAMPFERDING",187179,9685,""]
[null,"TÜRKENFELD","TÜRKENFELD",179149,8490,""]
[null,"TÜRKENFELD","ZANKENHAUSEN",179149,8491,""]
[null,"TÜRKHEIM","TÜRKHEIM",778203,7787,""]
[null,"TÜRKHEIM","IRSINGEN",778203,7788,""]
[null,"TUSSENHAUSEN","ZAISERTSHOFEN",778204,7769,""]
[null,"TUSSENHAUSEN","TUSSENHAUSEN",778204,7770,""]
[null,"TUSSENHAUSEN","MATTSIES",778204,7771,""]
[null,"TÜßLING","TÜßLING",171133,8938,""]
[null,"TÜßLING","UNTERBURGKIRCHEN",171133,8939,""]
[null,"TÜßLING","MÖRMOOSEN",171133,8950,""]
[null,"TUTZING","TRAUBING",188141,9193,""]
[null,"TUTZING","TUTZING",188141,9196,""]
[null,"TYRLACHING","TYRLACHING",171134,8951,""]
[null,"ÜBERSEE","ÜBERSEE",189159,9844,""]
[null,"ÜCHTELHAUSEN","JEUSING",678186,832,""]
[null,"ÜCHTELHAUSEN","MADENHAUSEN",678186,833,""]
[null,"ÜCHTELHAUSEN","EBERTSHAUSEN",678186,834,""]
[null,"ÜCHTELHAUSEN","WEIPOLTSHAUSEN",678186,845,""]
[null,"ÜCHTELHAUSEN","HESSELBACH",678186,846,""]
[null,"ÜCHTELHAUSEN","ZELL",678186,859,""]
[null,"ÜCHTELHAUSEN","ÜCHTELHAUSEN",678186,860,""]
[null,"UEHLFELD","UEHLFELD",575167,3268,""]
[null,"UEHLFELD","SCHORNWEISACH",575167,3269,""]
[null,"UEHLFELD","TRAGELHÖCHSTÄDT",575167,3270,""]
[null,"UEHLFELD","DEMANTSFÜRTH",575167,3271,""]
[null,"UEHLFELD","PEPPENHÖCHSTÄDT",575167,3272,""]
[null,"UETTINGEN","UETTINGEN",679196,692,""]
[null,"UFFENHEIM","BRACKENLOHR",575168,2915,""]
[null,"UFFENHEIM","CUSTENLOHR",575168,2924,""]
[null,"UFFENHEIM","LANGENSTEINACH",575168,2985,""]
[null,"UFFENHEIM","RUDOLZHOFEN",575168,3026,""]
[null,"UFFENHEIM","UFFENHEIM",575168,3045,""]
[null,"UFFENHEIM","UTTENHOFEN",575168,3053,""]
[null,"UFFENHEIM","WALLMERSBACH",575168,3059,""]
[null,"UFFENHEIM","WELBHAUSEN",575168,3063,""]
[null,"UFFING A.STAFFELSEE","SCHÖFFAU",180134,9233,""]
[null,"UFFING A.STAFFELSEE","UFFING A.STAFFELSEE",180134,9234,""]
[null,"UNGERHAUSEN","UNGERHAUSEN",778205,7578,""]
[null,"UNGERHAUSER WALD","UNGERHAUSER WALD",778451,7581,""]
[null,"UNSLEBEN","UNSLEBEN",673175,52,""]
[null,"UNTERAMMERGAU","UNTERAMMERGAU",180135,9251,""]
[null,"UNTERBRUNN","UNTERBRUNN",188452,9163,""]
[null,"UNTERDIEßEN","DORNSTETTEN",181143,9010,""]
[null,"UNTERDIEßEN","OBERDIEßEN",181143,9039,""]
[null,"UNTERDIEßEN","UNTERDIEßEN",181143,9068,""]
[null,"UNTERDIETFURT","HULDSESSEN",277151,6424,""]
[null,"UNTERDIETFURT","UNTERDIETFURT",277151,6471,""]
[null,"UNTEREGG","UNTEREGG",778207,7800,""]
[null,"UNTEREGG","WARMISRIED",778207,7801,""]
[null,"UNTEREGG","OBEREGGMN",778207,7802,""]
[null,"UNTERER WALD","KEMMATHEN",571451,3170,""]
[null,"UNTERFÖHRING","UNTERFÖHRING",184147,8709,""]
[null,"UNTERGRIESBACH","SCHAIBING",275153,6333,""]
[null,"UNTERGRIESBACH","OBERÖTZDORF",275153,6334,""]
[null,"UNTERGRIESBACH","UNTERGRIESBACH",275153,6335,""]
[null,"UNTERGRIESBACH","LÄMMERSDORF",275153,6336,""]
[null,"UNTERGRIESBACH","GOTTSDORF",275153,6337,""]
[null,"UNTERHACHING","UNTERHACHING",184148,8710,""]
[null,"UNTERHACHING","PERLACHER FORST",184148,8720,""]
[null,"UNTERLEINLEITER","DÜRRBRUNN",474168,2620,""]
[null,"UNTERLEINLEITER","UNTERLEINLEITER",474168,2621,""]
[null,"UNTERMEITINGEN","UNTERMEITINGEN",772209,7331,""]
[null,"UNTERMERZBACH","GEREUTH",674210,2166,{"$f":"+IF(A7746<>\"\",1,\"\")","v":""}]
[null,"UNTERMERZBACH","GLEUSDORF",674210,2167,""]
[null,"UNTERMERZBACH","LICHTENSTEIN",674210,2212,""]
[null,"UNTERMERZBACH","MEMMELSDORF I.UFR.",674210,2228,""]
[null,"UNTERMERZBACH","OBERMERZBACH",674210,2246,""]
[null,"UNTERMERZBACH","RECHELDORF",674210,2261,""]
[null,"UNTERMERZBACH","UNTERMERZBACH",674210,2318,""]
[null,"UNTERMERZBACH","WÜSTENWELSBERG",674210,2342,""]
[null,"UNTERNEUKIRCHEN","OBERBURGKIRCHEN",171135,8925,""]
[null,"UNTERNEUKIRCHEN","UNTERNEUKIRCHEN",171135,8941,""]
[null,"UNTERPLEICHFELD","HILPERTSHAUSEN",679201,669,""]
[null,"UNTERPLEICHFELD","BURGGRUMBACH",679201,670,""]
[null,"UNTERPLEICHFELD","UNTERPLEICHFELD",679201,678,""]
[null,"UNTERREIT","WALD",183147,9732,""]
[null,"UNTERREIT","WANG",183147,9733,""]
[null,"UNTERREIT","ELSBETH",183147,9734,""]
[null,"UNTERREIT","GRÜNTHAL",183147,9735,""]
[null,"UNTERROGGENBURGER WALD","UNTERROGGENBURGER WALD",775455,7102,""]
[null,"UNTERROTH","UNTERROTH",775161,7521,""]
[null,"UNTERSCHLEIßHEIM","UNTERSCHLEIßHEIM",184149,8712,""]
[null,"UNTERSCHWANINGEN","DENNENLOHE",571208,3658,""]
[null,"UNTERSCHWANINGEN","OBERSCHWANINGEN",571208,3659,""]
[null,"UNTERSCHWANINGEN","UNTERSCHWANINGEN",571208,3660,""]
[null,"UNTERSCHWANINGEN","KRÖTTENBACH",571208,3661,""]
[null,"UNTERSIEMAU","BIRKACH A.FORST",473170,1312,""]
[null,"UNTERSIEMAU","HAARTH",473170,1368,""]
[null,"UNTERSIEMAU","MESCHENBACH",473170,1413,""]
[null,"UNTERSIEMAU","OBERSIEMAU",473170,1444,""]
[null,"UNTERSIEMAU","SCHERNECK",473170,1469,""]
[null,"UNTERSIEMAU","STÖPPACH",473170,1489,""]
[null,"UNTERSIEMAU","UNTERSIEMAU",473170,1507,""]
[null,"UNTERSIEMAU","WEIßENBRUNN A.FORST",473170,1521,""]
[null,"UNTERSIEMAU","ZIEGELSDORF",473170,1537,""]
[null,"UNTERSTEINACH","UNTERSTEINACH",477159,1760,""]
[null,"UNTERTHINGAU","REINHARDSRIED",777175,7879,""]
[null,"UNTERTHINGAU","UNTERTHINGAU",777175,7880,""]
[null,"UNTERTHINGAU","OBERTHINGAU",777175,7881,""]
[null,"UNTERWÖSSEN","OBERWÖSSEN",189160,9872,""]
[null,"UNTERWÖSSEN","UNTERWÖSSEN",189160,9873,""]
[null,"UNTRASRIED","UNTRASRIED",777176,7690,""]
[null,"UNTRASRIED","HOPFERBACH",777176,7691,""]
[null,"URSBERG","OBERROHR",774116,7728,""]
[null,"URSBERG","URSBERG",774116,7729,""]
[null,"URSBERG","BAYERSRIED",774116,7730,""]
[null,"URSBERG","PREMACH",774116,7731,""]
[null,"URSBERG","MINDELZELL",774116,7732,""]
[null,"URSENSOLLEN","WOLFSFELD",371154,4529,""]
[null,"URSENSOLLEN","GÖTZENDORF",371154,4530,""]
[null,"URSENSOLLEN","ULLERSBERG",371154,4531,""]
[null,"URSENSOLLEN","URSENSOLLEN",371154,4532,""]
[null,"URSENSOLLEN","HOHENKEMNATH",371154,4533,""]
[null,"URSENSOLLEN","HAAG",371154,4534,""]
[null,"URSENSOLLEN","WINKL",371154,4544,""]
[null,"URSENSOLLEN","HAUSEN",371154,4545,""]
[null,"URSENSOLLEN","ZANT",371154,4546,""]
[null,"URSENSOLLEN","GARSDORF",371154,4547,""]
[null,"URSENSOLLEN","SAUHEIM",371154,4548,""]
[null,"URSENSOLLEN","THONHAUSEN",371154,4559,""]
[null,"URSPRINGEN","URSPRINGEN",677193,585,""]
[null,"USTERSBACH","USTERSBACH",772211,7278,""]
[null,"UTTENREUTH","UTTENREUTH",572158,2839,""]
[null,"UTTENREUTH","WEIHER",572158,2844,""]
[null,"UTTING A.AMMERSEE","HECHENWANG",181144,9024,""]
[null,"UTTING A.AMMERSEE","RIEDEN A.AMMERSEE",181144,9056,""]
[null,"UTTING A.AMMERSEE","UTTING A.AMMERSEE",181144,9074,{"$f":"+IF(A7810<>\"\",1,\"\")","v":""}]
[null,"VACHENDORF","HASLACH",189161,9851,""]
[null,"VACHENDORF","VACHENDORF",189161,9863,""]
[null,"VALLEY","FÖCHING",182133,9504,""]
[null,"VALLEY","VALLEY",182133,9505,""]
[null,"VATERSTETTEN","PARSDORF",175132,8772,""]
[null,"VATERSTETTEN","PÖRING",175132,8775,""]
[null,"VATERSTETTEN","ZORNEDING",175132,8780,""]
[null,"VEITSBRONN","HORBACH",573130,3328,""]
[null,"VEITSBRONN","TUCHENBACH",573130,3331,""]
[null,"VEITSBRONN","VEITSBRONN",573130,3332,""]
[null,"VEITSHÖCHHEIM","VEITSHÖCHHEIM",679202,685,""]
[null,"VEITSHÖCHHEIM","OBERDÜRRBACH",679202,686,""]
[null,"VELBURG","DEUSMAUER",373167,4612,""]
[null,"VELBURG","GEROLDSEE",373167,4623,""]
[null,"VELBURG","GÜNCHING",373167,4627,""]
[null,"VELBURG","LENGENFELD",373167,4642,""]
[null,"VELBURG","MANTLACH B.VELBURG",373167,4647,""]
[null,"VELBURG","OBERWEILING",373167,4660,""]
[null,"VELBURG","OBERWIESENACKER",373167,4661,""]
[null,"VELBURG","PRÖNSDORF",373167,4672,""]
[null,"VELBURG","REICHERTSWINN",373167,4676,""]
[null,"VELBURG","RONSOLDEN",373167,4679,""]
[null,"VELBURG","VELBURG",373167,4699,""]
[null,"VELDEN (LKR. LA)","HOLZHAUSEN",274183,6657,""]
[null,"VELDEN (LKR. LA)","NEUFRAUNHOFEN",274183,6671,""]
[null,"VELDEN (LKR. LA)","VILSLERN",274183,6672,""]
[null,"VELDEN (LKR. LA)","RUPRECHTSBERG",274183,6673,""]
[null,"VELDEN (LKR. LA)","EBERSPOINT",274183,6674,""]
[null,"VELDEN (LKR. LA)","VELDEN",274183,6675,""]
[null,"VELDEN (LKR. LA)","BABING",274183,6676,""]
[null,"VELDEN (LKR. RH)","TREUF",574160,3577,""]
[null,"VELDEN (LKR. RH)","VELDEN",574160,3579,""]
[null,"VELDEN (LKR. RH)","VIEHHOFEN",574160,3581,""]
[null,"VELDENSTEINERFORST","VELDENSTEINERFORST",472468,2556,""]
[null,"VESTENBERGSGREUTH","DUTENDORF",572159,2769,""]
[null,"VESTENBERGSGREUTH","FRICKENHÖCHSTADT",572159,2781,""]
[null,"VESTENBERGSGREUTH","FRIMMERSDORF",572159,2782,""]
[null,"VESTENBERGSGREUTH","KLEINWEISACH",572159,2807,""]
[null,"VESTENBERGSGREUTH","VESTENBERGSGREUTH",572159,2841,""]
[null,"VIECHTACH","BLOSSERSBERG",276144,5707,""]
[null,"VIECHTACH","WIESING",276144,5708,""]
[null,"VIECHTACH","NEUNUßBERG",276144,5714,""]
[null,"VIECHTACH","VIECHTACH",276144,5716,""]
[null,"VIECHTACH","SCHÖNAU",276144,5718,""]
[null,"VIECHTACH","SCHLATZENDORF",276144,5721,""]
[null,"VIECHTACH","VIECHTACH, BERGWERKE",276144,5763,""]
[null,"VIERETH-TRUNSTADT","TRUNSTADT",471207,2313,""]
[null,"VIERETH-TRUNSTADT","VIERETH",471207,2324,""]
[null,"VIERKIRCHEN","VIERKIRCHEN",174150,8551,""]
[null,"VIERKIRCHEN","BIBERBACH",174150,8607,""]
[null,"VIERKIRCHEN","GIEBING",174150,8616,""]
[null,"VIERKIRCHEN","PASENBACH",174150,8635,""]
[null,"VILGERTSHOFEN","ISSING",181133,9029,""]
[null,"VILGERTSHOFEN","MUNDRACHING",181133,9037,""]
[null,"VILGERTSHOFEN","PFLUGDORF",181133,9049,""]
[null,"VILGERTSHOFEN","STADL",181133,9064,""]
[null,"VILLENBACH","RIEDSEND",773179,6884,""]
[null,"VILLENBACH","WENGEN",773179,6885,""]
[null,"VILLENBACH","VILLENBACH",773179,6886,""]
[null,"VILSBIBURG","BERGHAM",274184,6658,""]
[null,"VILSBIBURG","SEYBOLDSDORF",274184,6659,""]
[null,"VILSBIBURG","VILSBIBURG",274184,6660,""]
[null,"VILSBIBURG","FRAUENSATTLING",274184,6661,""]
[null,"VILSBIBURG","GAINDORF",274184,6662,{"$f":"+IF(A7874<>\"\",1,\"\")","v":""}]
[null,"VILSBIBURG","HAARBACH",274184,6663,""]
[null,"VILSBIBURG","WOLFERDING",274184,6664,""]
[null,"VILSECK","LANGENBRUCK",371156,4456,""]
[null,"VILSECK","SIGL",371156,4457,""]
[null,"VILSECK","SCHLICHT",371156,4458,""]
[null,"VILSECK","VILSECK",371156,4459,""]
[null,"VILSECK","GRESSENWÖHR",371156,4460,""]
[null,"VILSECK","SEUGAST",371156,4461,""]
[null,"VILSECK","IRLBACH",371156,4473,""]
[null,"VILSHEIM","MÜNCHSDORF",274185,6644,""]
[null,"VILSHEIM","VILSHEIM",274185,6650,""]
[null,"VILSHEIM","GUNDIHAUSEN",274185,6651,""]
[null,"VILSHOFEN","ALBERSDORF",275154,6256,""]
[null,"VILSHOFEN","PLEINTING",275154,6260,""]
[null,"VILSHOFEN","ALKOFEN",275154,6261,""]
[null,"VILSHOFEN","VILSHOFEN",275154,6262,""]
[null,"VILSHOFEN","AUNKIRCHEN",275154,6263,""]
[null,"VILSHOFEN","ZEITLARN",275154,6264,""]
[null,"VILSHOFEN","SANDBACH",275154,6265,""]
[null,"VOGTAREUTH","VOGTAREUTH",187181,9680,""]
[null,"VOHBURG A.D.DONAU","OBERHARTHEIM",186158,8151,""]
[null,"VOHBURG A.D.DONAU","MENNING",186158,8152,""]
[null,"VOHBURG A.D.DONAU","IRSCHING",186158,8153,""]
[null,"VOHBURG A.D.DONAU","DÜNZING",186158,8154,""]
[null,"VOHBURG A.D.DONAU","VOHBURG A.D.DONAU",186158,8155,""]
[null,"VOHBURG A.D.DONAU","ROCKOLDING",186158,8156,""]
[null,"VOHBURG A.D.DONAU","OBERWÖHR",186158,8157,""]
[null,"VOHENSTRAUß","WALDAU",374162,4363,""]
[null,"VOHENSTRAUß","ALTENSTADT B.VOHENSTRAUß",374162,4364,""]
[null,"VOHENSTRAUß","VOHENSTRAUß",374162,4365,""]
[null,"VOHENSTRAUß","WEIßENSTEIN",374162,4366,""]
[null,"VOHENSTRAUß","BURGTRESWITZ",374162,4367,""]
[null,"VOHENSTRAUß","ROGGENSTEIN",374162,4368,""]
[null,"VOHENSTRAUß","LÄMERSDORF",374162,4369,""]
[null,"VOHENSTRAUß","KAIMLING",374162,4370,""]
[null,"VOHENSTRAUß","OBERLIND",374162,4371,""]
[null,"VOHENSTRAUß","OBERNANKAU",374162,4372,""]
[null,"VOHENSTRAUß","BÖHMISCHBRUCK",374162,4373,""]
[null,"VOHENSTRAUß","GRÖBENSTÄDT",374162,4374,""]
[null,"VOHENSTRAUß","VOHENSTRAUß, BERGWERKE",374162,4414,""]
[null,"VÖHRINGEN","ILLERZELL",775162,7501,""]
[null,"VÖHRINGEN","VÖHRINGEN",775162,7502,""]
[null,"VÖHRINGEN","THAL",775162,7503,""]
[null,"VÖHRINGEN","ILLERBERG",775162,7504,""]
[null,"VOLKACH","FAHR",675174,1101,""]
[null,"VOLKACH","GAIBACH",675174,1102,""]
[null,"VOLKACH","ESCHERNDORF",675174,1103,""]
[null,"VOLKACH","ASTHEIM",675174,1104,""]
[null,"VOLKACH","VOLKACH",675174,1105,""]
[null,"VOLKACH","OBERVOLKACH",675174,1106,""]
[null,"VOLKACH","KRAUTHEIM",675174,1107,""]
[null,"VOLKACH","KÖHLER",675174,1109,""]
[null,"VOLKACH","HALLBURG",675174,1111,""]
[null,"VOLKACH","RIMBACH",675174,1112,""]
[null,"VOLKACH","EICHFELD",675174,1113,""]
[null,"VOLKACH","DIMBACH",675174,1126,""]
[null,"VOLKENSCHWAND","GROßGUNDERTSHAUSEN",273178,6026,""]
[null,"VOLKENSCHWAND","LEIBERSDORF",273178,6048,""]
[null,"VOLKENSCHWAND","VOLKENSCHWAND",273178,6102,""]
[null,"VOLLBURG","PRÜßBERG",678456,1040,""]
[null,"VORBACH","HÖFLAS",374163,4251,""]
[null,"VORBACH","VORBACH",374163,4252,""]
[null,"VORBACH","OBERBIBRACH",374163,4253,""]
[null,"VORDORFER FORST","VORDORFER FORST",479461,2058,{"$f":"+IF(A7938<>\"\",1,\"\")","v":""}]
[null,"VORRA","ALFALTER",574161,3501,""]
[null,"VORRA","ARTELSHOFEN",574161,3505,""]
[null,"VORRA","VORRA",574161,3582,""]
[null,"WAAKIRCHEN","SCHAFTLACH",182134,9419,""]
[null,"WAAKIRCHEN","WAAKIRCHEN",182134,9420,""]
[null,"WAAL","BRONNEN",777177,7833,""]
[null,"WAAL","WAAL",777177,7834,""]
[null,"WAAL","EMMENHAUSEN",777177,7835,""]
[null,"WAAL","WAALHAUPTEN",777177,7836,""]
[null,"WACHENROTH","SCHIRNSDORF",572160,2832,""]
[null,"WACHENROTH","WACHENROTH",572160,2842,""]
[null,"WACHENROTH","WARMERSDORF",572160,2843,""]
[null,"WACHENROTH","WEINGARTSGREUTH",572160,2845,""]
[null,"WACKERSBERG","UNTERFISCHBACH",173145,9404,""]
[null,"WACKERSBERG","OBERFISCHBACH",173145,9405,""]
[null,"WACKERSBERG","WACKERSBERG",173145,9406,""]
[null,"WACKERSDORF","WACKERSDORF",376175,4756,""]
[null,"WACKERSDORF","RAUBERWEIHERHAUS",376175,4757,""]
[null,"WACKERSDORF","ALBERNDORF",376175,4761,""]
[null,"WAFFENBRUNN","OBERNRIED",372168,5042,""]
[null,"WAFFENBRUNN","KOLMBERG",372168,5043,""]
[null,"WAFFENBRUNN","WAFFENBRUNN",372168,5044,""]
[null,"WAFFENBRUNN","RHANWALTING",372168,5045,""]
[null,"WAFFENBRUNN","HABERSDORF",372168,5048,""]
[null,"WAGING A.SEE","OTTING",189162,9834,""]
[null,"WAGING A.SEE","FREIMANN",189162,9835,""]
[null,"WAGING A.SEE","WAGING A.SEE",189162,9836,""]
[null,"WAGING A.SEE","GADEN",189162,9837,""]
[null,"WAGING A.SEE","NIRNHARTING",189162,9838,""]
[null,"WAGING A.SEE","TETTENHAUSEN",189162,9839,""]
[null,"WAGINGER SEE","WAGINGER SEE",189452,9915,""]
[null,"WAIDACHER FORST","WAIDACHER FORST",472469,2547,""]
[null,"WAIDHAUS","REINHARDSRIETH",374164,4343,""]
[null,"WAIDHAUS","WAIDHAUS",374164,4348,""]
[null,"WAIDHAUS","PFRENTSCH",374164,4349,""]
[null,"WAIDHOFEN","WANGEN",185166,8110,""]
[null,"WAIDHOFEN","WAIDHOFEN",185166,8111,""]
[null,"WAIDHOFEN","DIEPOLTSHOFEN",185166,8112,""]
[null,"WAIGOLSHAUSEN","WAIGOLSHAUSEN",678190,977,""]
[null,"WAIGOLSHAUSEN","HERGOLSHAUSEN",678190,978,""]
[null,"WAIGOLSHAUSEN","THEILHEIM",678190,998,""]
[null,"WAISCHENFELD","BREITENLESAU",472197,2471,""]
[null,"WAISCHENFELD","NANKENDORF",472197,2472,""]
[null,"WAISCHENFELD","LÖHLITZ",472197,2473,""]
[null,"WAISCHENFELD","WAISCHENFELD",472197,2474,""]
[null,"WAISCHENFELD","HANNBERG",472197,2475,""]
[null,"WAISCHENFELD","SEELIG",472197,2476,""]
[null,"WAISCHENFELD","GÖSSELDORF",472197,2477,""]
[null,"WAISCHENFELD","LANGENLOH",472197,2478,""]
[null,"WAISCHENFELD","EICHENBIRKIG",472197,2479,""]
[null,"WAISCHENFELD","KÖTTWEINSDORF",472197,2480,""]
[null,"WALD (LKR. CHA)","WALD",372169,5125,""]
[null,"WALD (LKR. CHA)","BUCHENDORF",372169,5126,""]
[null,"WALD (LKR. CHA)","MAINSBAUERN",372169,5127,""]
[null,"WALD (LKR. CHA)","SÜSSENBACH",372169,5128,""]
[null,"WALD (LKR. CHA)","SIEGENSTEIN",372169,5129,""]
[null,"WALD (LKR. OAL)","WALD",777179,7894,""]
[null,"WALDASCHAFF","WALDASCHAFF",671156,372,""]
[null,"WALDASCHAFF","WALDASCHAFFER FORST",671156,373,""]
[null,"WALDASCHAFFER FORST","WALDASCHAFF",671460,372,""]
[null,"WALDASCHAFFER FORST","WALDASCHAFFER FORST",671460,373,""]
[null,"WALDASCHAFFER FORST","MESPELBRUNN",671460,387,""]
[null,"WALDBRUNN","WALDBRUNN",679204,702,""]
[null,"WALDBÜTTELBRUNN","ROßBRUNN",679205,693,{"$f":"+IF(A8002<>\"\",1,\"\")","v":""}]
[null,"WALDBÜTTELBRUNN","WALDBÜTTELBRUNN",679205,703,""]
[null,"WALDERBACH","HAUS",372170,5118,""]
[null,"WALDERBACH","DIEBERG",372170,5119,""]
[null,"WALDERBACH","WALDERBACH",372170,5120,""]
[null,"WALDERBACH","KIRCHENROHRBACH",372170,5121,""]
[null,"WALDERBACH","KATZENROHRBACH",372170,5122,""]
[null,"WALDERSHOF","KÖSSAIN",377157,4106,""]
[null,"WALDERSHOF","RODENZENREUTH",377157,4107,""]
[null,"WALDERSHOF","WALDERSHOF",377157,4108,""]
[null,"WALDERSHOF","LENGENFELD B.GROSCHLATTENGRÜN",377157,4109,""]
[null,"WALDERSHOF","HELMBRECHTS",377157,4110,""]
[null,"WALDERSHOF","WALBENREUTH",377157,4111,""]
[null,"WALDERSHOF","POPPENREUTH",377157,4112,""]
[null,"WALDERSHOF","HOHENHARD",377157,4113,""]
[null,"WALDFENSTERER FORST","WALDFENSTERER FORST",672468,199,""]
[null,"WALDHÄUSER WALD","NEUSCHÖNAU",272463,5806,""]
[null,"WALDKIRCHEN","KARLSBACH",272151,5863,""]
[null,"WALDKIRCHEN","BÖHMZWIESEL",272151,5864,""]
[null,"WALDKIRCHEN","SCHIEFWEG",272151,5876,""]
[null,"WALDKIRCHEN","STADL",272151,5877,""]
[null,"WALDKIRCHEN","UNTERHÖHENSTETTEN",272151,5881,""]
[null,"WALDKIRCHEN","WALDKIRCHEN",272151,5882,""]
[null,"WALDKIRCHEN","RATZING",272151,5883,""]
[null,"WALDKIRCHEN","OBERFRAUENWALD",272151,5884,""]
[null,"WALDKRAIBURG","FRAHAM",183148,8847,""]
[null,"WALDKRAIBURG","WALDKRAIBURG",183148,8848,""]
[null,"WALDKRAIBURG","PÜRTEN",183148,8849,""]
[null,"WALDMÜNCHEN","UNTERGRAFENRIED",372171,5011,""]
[null,"WALDMÜNCHEN","SPIELBERG",372171,5012,""]
[null,"WALDMÜNCHEN","HÖLL",372171,5013,""]
[null,"WALDMÜNCHEN","ARNSTEIN",372171,5014,""]
[null,"WALDMÜNCHEN","SCHÄFEREI",372171,5015,""]
[null,"WALDMÜNCHEN","AST",372171,5016,""]
[null,"WALDMÜNCHEN","HOCHA",372171,5017,""]
[null,"WALDMÜNCHEN","WALDMÜNCHEN",372171,5018,""]
[null,"WALDMÜNCHEN","ULRICHSGRÜN",372171,5019,""]
[null,"WALDMÜNCHEN","ENGLMANNSBRUNN",372171,5020,""]
[null,"WALDMÜNCHEN","ALBERNHOF",372171,5021,""]
[null,"WALDMÜNCHEN","PROSDORF",372171,5022,""]
[null,"WALDMÜNCHEN","RANNERSDORF",372171,5023,""]
[null,"WALDMÜNCHEN","HERZOGAU",372171,5024,""]
[null,"WALDMÜNCHEN","SINZENDORF",372171,5025,""]
[null,"WALDMÜNCHEN","GEIGANT",372171,5026,""]
[null,"WALDMÜNCHEN","KATZBACH",372171,5027,""]
[null,"WALDMÜNCHEN","HÄUSLARN",372171,5028,""]
[null,"WALDMÜNCHEN","HERZOGAU - WALDMÜNCHEN",372171,5174,""]
[null,"WALDSASSEN","MÜNCHENREUTH",377158,4101,""]
[null,"WALDSASSEN","KONDRAU",377158,4102,""]
[null,"WALDSASSEN","WALDSASSEN",377158,4104,""]
[null,"WALDSASSEN","QUERENBACH",377158,4105,""]
[null,"WALDSASSEN","WERNERSREUTH",377158,4122,""]
[null,"WALDSTETTEN","WALDSTETTEN",774191,7155,""]
[null,"WALDTHURN","SPIELBERG",374165,4334,""]
[null,"WALDTHURN","LENNESRIETH",374165,4335,""]
[null,"WALDTHURN","WALDTHURN",374165,4336,""]
[null,"WALDTHURN","BERNRIETH",374165,4337,""]
[null,"WALKERTSHOFEN","WALKERTSHOFEN",772214,7312,""]
[null,"WALLENFELS","WOLFERSGRÜN",476184,1619,""]
[null,"WALLENFELS","NEUENGRÜN",476184,1620,""]
[null,"WALLENFELS","SCHNAID",476184,1621,""]
[null,"WALLENFELS","WALLENFELS",476184,1622,""]
[null,"WALLENFELS","DÖRNACH",476184,1623,""]
[null,"WALLENFELS","GEUSER",476184,1624,""]
[null,"WALLERFING","NEUSLING",271152,5960,{"$f":"+IF(A8066<>\"\",1,\"\")","v":""}]
[null,"WALLERFING","WALLERFING",271152,5961,""]
[null,"WALLERFING","RAMSDORF",271152,5962,""]
[null,"WALLERSDORF","ETTLING",279137,6158,""]
[null,"WALLERSDORF","ALTENBUCH",279137,6214,""]
[null,"WALLERSDORF","HAIDENKOFEN",279137,6215,""]
[null,"WALLERSDORF","HAIDLFING",279137,6216,""]
[null,"WALLERSDORF","WALLERSDORF",279137,6217,""]
[null,"WALLERSTEIN","MUNZINGEN",779224,6729,""]
[null,"WALLERSTEIN","BIRKHAUSEN",779224,6730,""]
[null,"WALLERSTEIN","WALLERSTEIN",779224,6731,""]
[null,"WALLERSTEIN","EHRINGEN",779224,6732,""]
[null,"WALLGAU","WALLGAU",180136,9257,""]
[null,"WALPERTSKIRCHEN","WALPERTSKIRCHEN",177142,8391,""]
[null,"WALSDORF","ERLAU",471208,2155,""]
[null,"WALSDORF","KOLMSDORF",471208,2205,""]
[null,"WALSDORF","WALSDORF",471208,2329,""]
[null,"WALTENHAUSEN","HAIRENBUCH",774192,7711,""]
[null,"WALTENHAUSEN","WALTENHAUSEN",774192,7712,""]
[null,"WALTENHAUSEN","WEILER",774192,7713,""]
[null,"WALTENHOFEN","WALTENHOFEN",780143,7680,""]
[null,"WALTENHOFEN","MEMHÖLZ",780143,7681,""]
[null,"WALTENHOFEN","NIEDERSONTHOFEN",780143,7682,""]
[null,"WALTENHOFEN","MARTINSZELL I.ALLGÄU",780143,7683,""]
[null,"WALTING","RAPPERSZELL",176165,4017,""]
[null,"WALTING","RIESHOFEN",176165,4018,""]
[null,"WALTING","ISENBRUNN",176165,4019,""]
[null,"WALTING","PFALZPAINT",176165,4020,""]
[null,"WALTING","GUNGOLDING",176165,4021,""]
[null,"WALTING","WALTING",176165,4022,""]
[null,"WALTING","INCHING",176165,4023,""]
[null,"WALTING","PFÜNZ",176165,4024,""]
[null,"WANG","SCHWEINERSDORF",178155,8275,""]
[null,"WANG","HAGSDORF",178155,8276,""]
[null,"WANG","INZKOFEN",178155,8277,""]
[null,"WANG","WANG",178155,8278,""]
[null,"WANG","VOLKMANNSDORFERAU",178155,8279,""]
[null,"WARMENSTEINACH","WARMENSTEINACH",472198,2385,""]
[null,"WARMENSTEINACH","OBERWARMENSTEINACH",472198,2386,""]
[null,"WARMENSTEINACH","MÄHRING",472198,2387,""]
[null,"WARMENSTEINACH","SOPHIENTHALER FORST",472198,2460,""]
[null,"WARMENSTEINACH","WARMENSTEINACHER FORST-SÜD",472198,2461,""]
[null,"WARMENSTEINACHER FORST-NORD","WARMENSTEINACHER FORST-NORD",472470,2384,""]
[null,"WARMENSTEINACHER FORST-SÜD","WARMENSTEINACHER FORST-SÜD",472471,2461,""]
[null,"WARNGAU","WARNGAU",182136,9507,""]
[null,"WARNGAU","WALL",182136,9508,""]
[null,"WARNGAU","GOTZING",182136,9509,""]
[null,"WARTENBERG","WARTENBERG",177143,8355,""]
[null,"WARTENBERG","AUERBACH",177143,8356,""]
[null,"WARTMANNSROTH","ROßBACHER FORST",672161,225,""]
[null,"WARTMANNSROTH","NEUWIRTSHAUSER FORST",672161,236,""]
[null,"WARTMANNSROTH","HEILIGKREUZ",672161,243,""]
[null,"WARTMANNSROTH","VÖLKERSLEIER",672161,248,""]
[null,"WARTMANNSROTH","SCHWÄRZELBACH",672161,249,""]
[null,"WARTMANNSROTH","DITTLOFSRODA",672161,259,""]
[null,"WARTMANNSROTH","WARTMANNSROTH",672161,260,""]
[null,"WARTMANNSROTH","WINDHEIM/WARTMANNSROTH",672161,261,""]
[null,"WARTMANNSROTH","WAIZENBACH",672161,276,""]
[null,"WARTMANNSROTH","DIEBACH",672161,278,""]
[null,"WARTMANNSROTH","UNTERESCHENBACH",672161,285,""]
[null,"WASSERBURG (BODENSEE","HEGE",776128,7932,""]
[null,"WASSERBURG (BODENSEE","WASSERBURG (BODENSEE)",776128,7933,""]
[null,"WASSERBURG A.INN","WASSERBURG A.INN",187182,9746,""]
[null,"WASSERBURG A.INN","ATTEL",187182,9749,""]
[null,"WASSERLOSEN","WASSERLOSEN",678192,854,{"$f":"+IF(A8130<>\"\",1,\"\")","v":""}]
[null,"WASSERLOSEN","GREßTHAL",678192,866,""]
[null,"WASSERLOSEN","SCHWEMMELSBACH",678192,867,""]
[null,"WASSERLOSEN","RÜTSCHENHAUSEN",678192,868,""]
[null,"WASSERLOSEN","WÜLFERSHAUSEN",678192,885,""]
[null,"WASSERLOSEN","BURGHAUSEN",678192,886,""]
[null,"WASSERLOSEN","KAISTEN",678192,887,""]
[null,"WASSERLOSEN","BREBERSDORF",678192,888,""]
[null,"WASSERTRÜDINGEN","WASSERTRÜDINGEN",571214,3684,""]
[null,"WASSERTRÜDINGEN","ALTENTRÜDINGEN",571214,3685,""]
[null,"WASSERTRÜDINGEN","OBERMÖGERSHEIM",571214,3686,""]
[null,"WASSERTRÜDINGEN","SCHOBDACH",571214,3687,""]
[null,"WASSERTRÜDINGEN","GEILSHEIM",571214,3688,""]
[null,"WASSERTRÜDINGEN","FÜRNHEIM",571214,3689,""]
[null,"WASSERTRÜDINGEN","REICHENBACH",571214,3690,""]
[null,"WATTENDORF","BOJENDORF",471209,2116,""]
[null,"WATTENDORF","GRÄFENHÄUSLING",471209,2168,""]
[null,"WATTENDORF","WATTENDORF",471209,2331,""]
[null,"WAXENBERGER FORST-WEST","HUNGERSACKER",375456,5265,""]
[null,"WECHINGEN","WECHINGEN",779226,6744,""]
[null,"WECHINGEN","HOLZKIRCHEN",779226,6745,""]
[null,"WECHINGEN","FESSENHEIM",779226,6746,""]
[null,"WEGSCHEID","THALBERG",275156,6338,""]
[null,"WEGSCHEID","MÖSLBERG",275156,6339,""]
[null,"WEGSCHEID","KASBERG",275156,6340,""]
[null,"WEGSCHEID","MEßNERSCHLAG",275156,6341,""]
[null,"WEGSCHEID","THURNREUTH",275156,6342,""]
[null,"WEGSCHEID","WILDENRANNA",275156,6343,""]
[null,"WEGSCHEID","WEGSCHEID",275156,6344,""]
[null,"WEGSCHEID","EIDENBERG",275156,6345,""]
[null,"WEHRINGEN","WEHRINGEN",772215,7322,""]
[null,"WEIBERSBRUNN","WEIBERSBRUNN",671157,385,""]
[null,"WEIBERSBRUNN","ROHRBRUNNER FORST",671157,388,""]
[null,"WEICHERING","WEICHERING",185168,8082,""]
[null,"WEICHERING","LICHTENAU",185168,8083,""]
[null,"WEICHS","WEICHS",174151,8552,""]
[null,"WEICHS","AINHOFEN",174151,8601,""]
[null,"WEICHS","ASBACH",174151,8605,""]
[null,"WEICHS","FRAUENHOFEN",174151,8615,""]
[null,"WEICHS","MARKT INDERSDORF",174151,8629,""]
[null,"WEICHS","PASENBACH",174151,8635,""]
[null,"WEIDEN I.D.OPF.","SCHWARZENBACH",363000,4351,""]
[null,"WEIDEN I.D.OPF.","MANTELER FORST",363000,4352,""]
[null,"WEIDEN I.D.OPF.","NEUNKIRCHEN B.WEIDEN",363000,4356,""]
[null,"WEIDEN I.D.OPF.","FRAUENRICHT",363000,4357,""]
[null,"WEIDEN I.D.OPF.","MALLERSRICHT",363000,4358,""]
[null,"WEIDEN I.D.OPF.","ROTHENSTADT",363000,4359,""]
[null,"WEIDEN I.D.OPF.","WEIDEN I.D.OPF.",363000,4360,""]
[null,"WEIDEN I.D.OPF.","MATZLESRIETH",363000,4361,""]
[null,"WEIDEN I.D.OPF.","MUGLHOF",363000,4362,""]
[null,"WEIDEN I.D.OPF.","WEIDEN, BERGWERKE",363000,4413,""]
[null,"WEIDENBACH","LEIDENDORF",571216,3178,""]
[null,"WEIDENBACH","WEIDENBACH",571216,3235,""]
[null,"WEIDENBERG","UNTERSTEINACH",472199,2444,""]
[null,"WEIDENBERG","DÖHLAU",472199,2445,""]
[null,"WEIDENBERG","GÖRSCHNITZ",472199,2446,""]
[null,"WEIDENBERG","SOPHIENTHAL",472199,2447,""]
[null,"WEIDENBERG","LANKENDORF",472199,2448,""]
[null,"WEIDENBERG","WEIDENBERG",472199,2449,""]
[null,"WEIDENBERG","MENGERSREUTH",472199,2450,""]
[null,"WEIDENBERG","NEUNKIRCHEN A.MAIN",472199,2451,""]
[null,"WEIDENBERG","LESSAU",472199,2452,""]
[null,"WEIDENBERG","FISCHBACH",472199,2453,""]
[null,"WEIDENBERG","LEHEN",472199,2454,""]
[null,"WEIDENBERG","SOPHIENTHALER FORST",472199,2460,{"$f":"+IF(A8194<>\"\",1,\"\")","v":""}]
[null,"WEIDHAUSEN B.COBURG","NEUENSORG",473174,1426,""]
[null,"WEIDHAUSEN B.COBURG","TRÜBENBACH",473174,1499,""]
[null,"WEIDHAUSEN B.COBURG","WEIDHAUSEN B.COBURG",473174,1516,""]
[null,"WEIDING (LKR CHAM)","HABERSDORF",372174,5048,""]
[null,"WEIDING (LKR CHAM)","DALKING",372174,5049,""]
[null,"WEIDING (LKR CHAM)","WEIDING (LKR CHAM)",372174,5050,""]
[null,"WEIDING (LKR CHAM)","WALTING",372174,5051,""]
[null,"WEIDING (LKR CHAM)","ARNSCHWANG",372174,5052,""]
[null,"WEIDING (LKR CHAM)","NÖßWARTLING",372174,5053,""]
[null,"WEIDING (LKR SCHWANDORF)","WEIDING (LKR SCHWANDORF)",376176,4849,""]
[null,"WEIGENDORF","WEIGENDORF",371157,4495,""]
[null,"WEIGENHEIM","SCHLOß FRANKENBERG",575179,2947,""]
[null,"WEIGENHEIM","GECKENHEIM",575179,2954,""]
[null,"WEIGENHEIM","REUSCH",575179,3022,""]
[null,"WEIGENHEIM","WEIGENHEIM",575179,3061,""]
[null,"WEIGLER","WEIGLER",673458,68,""]
[null,"WEIHENZELL","FORST",571217,3140,""]
[null,"WEIHENZELL","GEBERSDORF",571217,3142,""]
[null,"WEIHENZELL","HAASGANG",571217,3152,""]
[null,"WEIHENZELL","VESTENBERG",571217,3230,""]
[null,"WEIHENZELL","WEIHENZELL",571217,3236,""]
[null,"WEIHENZELL","WERNSBACH B.ANSBACH",571217,3241,""]
[null,"WEIHERHAMMER","MALLERSRICHT",374166,4358,""]
[null,"WEIHERHAMMER","KALTENBRUNN",374166,4387,""]
[null,"WEIHERHAMMER","RÖTHENBACH",374166,4388,""]
[null,"WEIHERHAMMER","ETZENRICHT",374166,4389,""]
[null,"WEIHERHAMMER","KOHLBERG",374166,4391,""]
[null,"WEIHMICHL","STOLLNRIED",274187,6564,""]
[null,"WEIHMICHL","SCHMATZHAUSEN",274187,6565,""]
[null,"WEIHMICHL","NEUHAUSEN B.LANDSHUT",274187,6582,""]
[null,"WEIHMICHL","WEIHMICHL",274187,6583,""]
[null,"WEIL","BEUERBACH",181145,9003,""]
[null,"WEIL","GERETSHAUSEN",181145,9020,""]
[null,"WEIL","PESTENACKER",181145,9047,""]
[null,"WEIL","PETZENHAUSEN",181145,9048,""]
[null,"WEIL","SCHWABHAUSEN B.LANDSBERG",181145,9061,""]
[null,"WEIL","WEIL",181145,9076,""]
[null,"WEILBACH","OHRENBACH",676165,461,""]
[null,"WEILBACH","WECKBACH",676165,462,""]
[null,"WEILBACH","WEILBACH",676165,463,""]
[null,"WEILBACH","REICHARTSHAUSEN",676165,470,""]
[null,"WEILERSBACH","OBERWEILERSBACH",474171,2659,""]
[null,"WEILERSBACH","UNTERWEILERSBACH",474171,2660,""]
[null,"WEILERSBACH","REIFENBERG",474171,2661,""]
[null,"WEILER-SIMMERBERG","ELLHOFEN",776129,7960,""]
[null,"WEILER-SIMMERBERG","WEILER I.ALLGÄU",776129,7961,""]
[null,"WEILER-SIMMERBERG","SIMMERBERG",776129,7962,""]
[null,"WEILHEIM I.OB","WEILHEIM I.OB",190157,9209,""]
[null,"WEILHEIM I.OB","UNTERHAUSEN",190157,9210,""]
[null,"WEILHEIM I.OB","DEUTENHAUSEN",190157,9211,""]
[null,"WEILTINGEN","WÖRNITZHOFEN",571218,3679,""]
[null,"WEILTINGEN","FRANKENHOFEN",571218,3680,""]
[null,"WEILTINGEN","WEILTINGEN",571218,3681,""]
[null,"WEILTINGEN","VEITSWEILER",571218,3682,""]
[null,"WEISENDORF","BOXBRUNN",572164,2758,""]
[null,"WEISENDORF","GROßENSEEBACH",572164,2787,""]
[null,"WEISENDORF","HAMMERBACH",572164,2789,""]
[null,"WEISENDORF","KAIRLINDACH",572164,2802,""]
[null,"WEISENDORF","OBERLINDACH",572164,2824,""]
[null,"WEISENDORF","REINERSDORF",572164,2827,""]
[null,"WEISENDORF","REZELSDORF",572164,2828,""]
[null,"WEISENDORF","SAUERHEIM",572164,2831,""]
[null,"WEISENDORF","UNTERREICHENBACH",572164,2837,""]
[null,"WEISENDORF","WEISENDORF",572164,2846,{"$f":"+IF(A8258<>\"\",1,\"\")","v":""}]
[null,"WEISMAIN","PFAFFENDORF",478176,1819,""]
[null,"WEISMAIN","MAINECKER FORST",478176,1822,""]
[null,"WEISMAIN","KASPAUER",478176,1823,""]
[null,"WEISMAIN","WEISMAIN",478176,1824,""]
[null,"WEISMAIN","GEUTENREUTH",478176,1825,""]
[null,"WEISMAIN","WALLERSBERG",478176,1826,""]
[null,"WEISMAIN","MODSCHIEDEL",478176,1827,""]
[null,"WEISMAIN","NEUDORF",478176,1828,""]
[null,"WEISMAIN","ARNSTEIN",478176,1829,""]
[null,"WEISMAIN","WEIDEN",478176,1830,""]
[null,"WEISMAIN","GROßZIEGENFELD",478176,1831,""]
[null,"WEISMAIN","KLEINZIEGENFELD",478176,1832,""]
[null,"WEISMAIN","FESSELSDORF",478176,1833,""]
[null,"WEISMAIN","BUCKENDORF",478176,1834,""]
[null,"WEIßDORF","WEIßDORF",475184,1952,""]
[null,"WEIßDORF","BUG",475184,1953,""]
[null,"WEIßDORF","WULMERSREUTH",475184,1954,""]
[null,"WEIßDORF","SEULBITZ",475184,1955,""]
[null,"WEIßDORF","HALLERSTEIN",475184,1956,""]
[null,"WEIßENBRUNN","THONBERG",476185,1651,""]
[null,"WEIßENBRUNN","HUMMENDORF",476185,1652,""]
[null,"WEIßENBRUNN","REUTH",476185,1653,""]
[null,"WEIßENBRUNN","EICHENBÜHL",476185,1654,""]
[null,"WEIßENBRUNN","WEIßENBRUNN",476185,1655,""]
[null,"WEIßENBRUNN","WILDENBERG",476185,1656,""]
[null,"WEIßENBRUNN","GÖSSERSDORF",476185,1657,""]
[null,"WEIßENBURG I.BAYERN","WEIBOLDSHAUSEN",577177,3715,""]
[null,"WEIßENBURG I.BAYERN","WEIMERSHEIM",577177,3734,""]
[null,"WEIßENBURG I.BAYERN","WEIßENBURG I.BAY.",577177,3735,""]
[null,"WEIßENBURG I.BAYERN","WÜLZBURG",577177,3736,""]
[null,"WEIßENBURG I.BAYERN","OBERHOCHSTATT",577177,3737,""]
[null,"WEIßENBURG I.BAYERN","KATTENHOCHSTATT",577177,3738,""]
[null,"WEIßENBURG I.BAYERN","HOLZINGEN",577177,3739,""]
[null,"WEIßENBURG I.BAYERN","EMETZHEIM",577177,3740,""]
[null,"WEIßENBURG I.BAYERN","DETTENHEIM",577177,3741,""]
[null,"WEIßENBURG I.BAYERN","HAARDT",577177,3742,""]
[null,"WEIßENBURG I.BAYERN","SUFFERSHEIM",577177,3743,""]
[null,"WEIßENBURG I.BAYERN","NEUDORF",577177,3758,""]
[null,"WEIßENHORN","ATTENHOFEN",775164,7087,""]
[null,"WEIßENHORN","OBERHAUSEN",775164,7088,""]
[null,"WEIßENHORN","WALLENHAUSEN",775164,7089,""]
[null,"WEIßENHORN","HEGELHOFEN",775164,7090,""]
[null,"WEIßENHORN","WEIßENHORN",775164,7091,""]
[null,"WEIßENHORN","OBERREICHENBACH",775164,7092,""]
[null,"WEIßENHORN","BIBERACHZELL",775164,7093,""]
[null,"WEIßENHORN","GRAFERTSHOFEN",775164,7094,""]
[null,"WEIßENHORN","EMERSHOFEN",775164,7095,""]
[null,"WEIßENHORN","BUBENHAUSEN",775164,7096,""]
[null,"WEIßENOHE","WEIßENOHE",474173,2703,""]
[null,"WEIßENSBERG","WEIßENSBERG",776130,7941,""]
[null,"WEIßENSTADT","REICHOLDSGRÜN",479166,2023,""]
[null,"WEIßENSTADT","WEIßENSTADT",479166,2046,""]
[null,"WEIßENSTADT","VOITSUMRA",479166,2047,""]
[null,"WEIßENSTADT","FRANKEN",479166,2048,""]
[null,"WEIßENSTADT","MEIERHÖFER SEITE",479166,2057,""]
[null,"WEIßENSTADTER FORST-NORD","WEIßENSTADTER FORST-NORD",479462,2030,""]
[null,"WEIßENSTADTER FORST-SÜD","WEIßENSTADTER FORST-SÜD",479463,2056,""]
[null,"WEITNAU","WENGEN",780144,7676,""]
[null,"WEITNAU","WEITNAU",780144,7677,""]
[null,"WEITNAU","RECHTIS",780144,7678,""]
[null,"WEITNAU","WALTRAMS",780144,7679,""]
[null,"WEITRAMSDORF","ALTENHOF",473175,1305,""]
[null,"WEITRAMSDORF","CALLENBERGER FORST-OST",473175,1325,""]
[null,"WEITRAMSDORF","NEUNDORF",473175,1429,{"$f":"+IF(A8322<>\"\",1,\"\")","v":""}]
[null,"WEITRAMSDORF","WEIDACH",473175,1515,""]
[null,"WEITRAMSDORF","WEITRAMSDORF",473175,1520,""]
[null,"WELDEN","WELDEN",772216,7219,""]
[null,"WELDEN","REUTERN",772216,7220,""]
[null,"WELDEN","STREITHEIM",772216,7245,""]
[null,"WELLHEIM","KONSTEIN",176166,4063,""]
[null,"WELLHEIM","BIESENHARD",176166,4064,""]
[null,"WELLHEIM","WELLHEIM",176166,4065,""]
[null,"WELLHEIM","GAMMERSFELD",176166,4066,""]
[null,"WELLUCKER WALD","KROTTENSEE",371457,3547,""]
[null,"WEMDING","AMERBACH",779228,6773,""]
[null,"WEMDING","WEMDING",779228,6774,""]
[null,"WENDELSTEIN","FORST KLEINSCHWARZENLOHE",576151,3825,""]
[null,"WENDELSTEIN","GROßSCHWARZENLOHE",576151,3832,""]
[null,"WENDELSTEIN","KLEINSCHWARZENLOHE",576151,3852,""]
[null,"WENDELSTEIN","RAUBERSRIED",576151,3883,""]
[null,"WENDELSTEIN","RÖTHENBACH B.SANKT WOLFGANG",576151,3889,""]
[null,"WENDELSTEIN","WENDELSTEIN",576151,3916,""]
[null,"WENG","VEITSBUCH",274188,6600,""]
[null,"WENG","WENG",274188,6601,""]
[null,"WENZENBACH","GRÜNTHAL I",375208,5248,""]
[null,"WENZENBACH","GRÜNTHAL II",375208,5249,""]
[null,"WENZENBACH","HAUZENSTEIN",375208,5259,""]
[null,"WENZENBACH","KREUTH",375208,5274,""]
[null,"WENZENBACH","WENZENBACH",375208,5349,""]
[null,"WERNBERG-KÖBLITZ","GLAUBENDORF",376150,4801,""]
[null,"WERNBERG-KÖBLITZ","DEINDORF",376150,4802,""]
[null,"WERNBERG-KÖBLITZ","OBERKÖBLITZ",376150,4803,""]
[null,"WERNBERG-KÖBLITZ","WERNBERG",376150,4804,""]
[null,"WERNBERG-KÖBLITZ","WOPPENHOF",376150,4805,""]
[null,"WERNBERG-KÖBLITZ","NEUNAIGEN",376150,4806,""]
[null,"WERNBERG-KÖBLITZ","SALTENDORF",376150,4807,""]
[null,"WERNBERG-KÖBLITZ","LOSAU",376150,4808,""]
[null,"WERNECK","VASBÜHL",678193,910,""]
[null,"WERNECK","EGENHAUSEN",678193,911,""]
[null,"WERNECK","STETTBACH",678193,927,""]
[null,"WERNECK","ECKARTSHAUSEN",678193,928,""]
[null,"WERNECK","SCHLEERIETH",678193,929,""]
[null,"WERNECK","RUNDELSHAUSEN",678193,930,""]
[null,"WERNECK","SCHNACKENWERTH",678193,931,""]
[null,"WERNECK","SCHRAUDENBACH",678193,951,""]
[null,"WERNECK","WERNECK",678193,952,""]
[null,"WERNECK","ETTLEBEN",678193,953,""]
[null,"WERNECK","MÜHLHAUSEN",678193,975,""]
[null,"WERNECK","ZEUZLEBEN",678193,976,""]
[null,"WERNECK","EßLEBEN",678193,997,""]
[null,"WERTACH","WERTACH",780145,7689,""]
[null,"WERTINGEN","WERTINGEN",773182,6875,""]
[null,"WERTINGEN","GOTTMANNSHOFEN",773182,6876,""]
[null,"WERTINGEN","HOHENREICHEN",773182,6877,""]
[null,"WERTINGEN","HIRSCHBACH",773182,6878,""]
[null,"WERTINGEN","ROGGDEN",773182,6879,""]
[null,"WERTINGEN","BLIENSBACH",773182,6880,""]
[null,"WERTINGEN","PRETTELSHOFEN",773182,6881,""]
[null,"WERTINGEN","RIEBLINGEN",773182,6882,""]
[null,"WERTINGEN","HETTLINGEN",773182,6883,""]
[null,"WEßLING","WEßLING",188144,9156,""]
[null,"WEßLING","OBERPFAFFENHOFEN",188144,9157,""]
[null,"WEßLING","HOCHSTADT",188144,9162,""]
[null,"WESSOBRUNN","HAID",190158,9206,""]
[null,"WESSOBRUNN","WESSOBRUNN",190158,9207,""]
[null,"WESSOBRUNN","FORST",190158,9208,""]
[null,"WESTENDORF (LKR OAL)","WESTENDORF",777182,7856,""]
[null,"WESTENDORF (LKR OAL)","DÖSINGEN",777182,7857,{"$f":"+IF(A8386<>\"\",1,\"\")","v":""}]
[null,"WESTENDORF (LKR. A)","WESTENDORF",772217,6989,""]
[null,"WESTERHEIM","GÜNZ",778214,7561,""]
[null,"WESTERHEIM","WESTERHEIM",778214,7562,""]
[null,"WESTERNGRUND","HUCKELHEIM",671159,304,""]
[null,"WESTERNGRUND","OBERWESTERN",671159,305,""]
[null,"WESTERNGRUND","UNTERWESTERN",671159,313,""]
[null,"WESTHEIM","OSTHEIM",577179,3640,""]
[null,"WESTHEIM","WESTHEIM",577179,3641,""]
[null,"WESTHEIM","HÜSSINGEN",577179,3642,""]
[null,"WETTRINGEN","GAILNAU",571222,2948,""]
[null,"WETTRINGEN","WETTRINGEN",571222,3064,""]
[null,"WETTSTETTEN","WETTSTETTEN",176167,8024,""]
[null,"WEYARN","HOLZOLLING",182137,9506,""]
[null,"WEYARN","GOTZING",182137,9509,""]
[null,"WEYARN","WATTERSDORF",182137,9510,""]
[null,"WEYARN","REICHERSDORF",182137,9511,""]
[null,"WIEDERGELTINGEN","WIEDERGELTINGEN",778216,7790,""]
[null,"WIELENBACH","WIELENBACH",190159,9204,""]
[null,"WIELENBACH","HAUNSHOFEN",190159,9205,""]
[null,"WIESAU","PECHBRUNN",377159,4116,""]
[null,"WIESAU","WIESAU",377159,4126,""]
[null,"WIESAU","SCHÖNHAID",377159,4127,""]
[null,"WIESAU","VOITENTHAN",377159,4130,""]
[null,"WIESEN","WIESEN",671162,320,""]
[null,"WIESENBACH","UNTERWIESENBACH",774189,7701,""]
[null,"WIESENBACH","OBERWIESENBACH",774189,7702,""]
[null,"WIESENBACH","OBEREGGGZ",774189,7703,""]
[null,"WIESENBRONN","WIESENBRONN",675177,1170,""]
[null,"WIESENER FORST","WIESENER FORST",671461,319,""]
[null,"WIESENFELDEN","ZINZENZELL",278197,5551,""]
[null,"WIESENFELDEN","HÖHENBERG",278197,5561,""]
[null,"WIESENFELDEN","WIESENFELDEN",278197,5562,""]
[null,"WIESENFELDEN","GERASZELL",278197,5563,""]
[null,"WIESENFELDEN","WAXENBERG",278197,5576,""]
[null,"WIESENFELDEN","SAULBURG",278197,5577,""]
[null,"WIESENT","DIETERSWEG",375209,5222,""]
[null,"WIESENT","FORSTMÜHLER FORST",375209,5231,""]
[null,"WIESENT","KRUCKENBERG",375209,5275,""]
[null,"WIESENT","WIESENT",375209,5350,""]
[null,"WIESENTHAU","WIESENTHAU",474175,2678,""]
[null,"WIESENTHAU","SCHLAIFHAUSEN",474175,2679,""]
[null,"WIESENTHEID","REUPELSDORF",675178,1127,""]
[null,"WIESENTHEID","FEUERBACH",675178,1142,""]
[null,"WIESENTHEID","WIESENTHEID",675178,1143,""]
[null,"WIESENTHEID","GEESDORF",675178,1144,""]
[null,"WIESENTHEID","UNTERSAMBACH",675178,1157,""]
[null,"WIESENTTAL","WÜSTENSTEIN",474176,2601,""]
[null,"WIESENTTAL","OBERFELLENDORF",474176,2602,""]
[null,"WIESENTTAL","ALBERTSHOF",474176,2603,""]
[null,"WIESENTTAL","STREITBERG",474176,2604,""]
[null,"WIESENTTAL","MUGGENDORF",474176,2605,""]
[null,"WIESENTTAL","ENGELHARDSBERG",474176,2606,""]
[null,"WIESENTTAL","BIRKENREUTH",474176,2607,""]
[null,"WIESENTTAL","WOHLMANNSGESEES",474176,2608,""]
[null,"WIESETH","AICHAU",571223,2903,""]
[null,"WIESETH","DEFFERSDORF",571223,2925,""]
[null,"WIESETH","WIESETH",571223,3066,""]
[null,"WIESTHAL","WIESTHAL",677200,533,""]
[null,"WIESTHAL","KROMMENTHAL",677200,535,""]
[null,"WIESTHAL","PARTENSTEINER FORST",677200,536,""]
[null,"WIGGENSBACH","WIGGENSBACH",780146,7669,""]
[null,"WILBURGSTETTEN","KNITTELSBACH",571224,3672,""]
[null,"WILBURGSTETTEN","WILBURGSTETTEN",571224,3675,""]
[null,"WILBURGSTETTEN","WITTENBACH",571224,3676,{"$f":"+IF(A8450<>\"\",1,\"\")","v":""}]
[null,"WILBURGSTETTEN","GREISELBACH",571224,3677,""]
[null,"WILBURGSTETTEN","RÜHLINGSTETTEN",571224,3678,""]
[null,"WILDENBERG","WILDENBERG",273181,6106,""]
[null,"WILDFLECKEN","NEUWILDFLECKEN",672163,153,""]
[null,"WILDFLECKEN","WILDFLECKEN",672163,156,""]
[null,"WILDFLECKEN","OBERWILDFLECKEN",672163,157,""]
[null,"WILDFLECKEN","OBERBACH",672163,160,""]
[null,"WILDFLECKEN","GROßER AUERSBERG",672163,162,""]
[null,"WILDPOLDSRIED","WILDPOLDSRIED",780147,7664,""]
[null,"WILDSTEIG","WILDSTEIG",190160,9103,""]
[null,"WILHELMSDORF","WILHELMSDORF",575181,3301,""]
[null,"WILHELMSDORF","EBERSBACH",575181,3302,""]
[null,"WILHELMSTHAL","EFFELTER",476189,1581,""]
[null,"WILHELMSTHAL","LAHM",476189,1582,""]
[null,"WILHELMSTHAL","GIFTING",476189,1583,""]
[null,"WILHELMSTHAL","HESSELBACH",476189,1584,""]
[null,"WILHELMSTHAL","WILHELMSTHAL",476189,1585,""]
[null,"WILHELMSTHAL","STEINBERG",476189,1586,""]
[null,"WILHELMSTHAL","EIBENBERG",476189,1587,""]
[null,"WILHELMSTHAL","ROßLACH",476189,1588,""]
[null,"WILHERMSDORF","WILHERMSDORF",573133,3321,""]
[null,"WILHERMSDORF","DIPPOLDSBERG",573133,3322,""]
[null,"WILHERMSDORF","KATTERBACH",573133,3323,""]
[null,"WILHERMSDORF","KIRCHFARRNBACH",573133,3324,""]
[null,"WILLANZHEIM","WILLANZHEIM",675179,1206,""]
[null,"WILLANZHEIM","MARKT HERRNSHEIM",675179,1220,""]
[null,"WILLANZHEIM","HÜTTENHEIM I.BAY.",675179,1238,""]
[null,"WILLMARS","FILKE",673182,10,""]
[null,"WILLMARS","WILLMARS",673182,14,""]
[null,"WILLMARS","VÖLKERSHAUSEN",673182,20,""]
[null,"WILLMERING","WILLMERING",372175,5046,""]
[null,"WINDACH","HECHENWANG",181146,9024,""]
[null,"WINDACH","OBERWINDACH",181146,9045,""]
[null,"WINDACH","SCHÖFFELDING",181146,9060,""]
[null,"WINDACH","UNTERWINDACH",181146,9073,""]
[null,"WINDBERG","WINDBERG",278198,5610,""]
[null,"WINDELSBACH","BURGHAUSEN",571225,2922,""]
[null,"WINDELSBACH","CADOLZHOFEN",571225,2923,""]
[null,"WINDELSBACH","NORDENBERG",571225,3004,""]
[null,"WINDELSBACH","PREUNTSFELDEN",571225,3021,""]
[null,"WINDELSBACH","WINDELSBACH",571225,3068,""]
[null,"WINDISCHESCHENBACH","BERNSTEIN",374168,4301,""]
[null,"WINDISCHESCHENBACH","NAABDEMENREUTH",374168,4302,""]
[null,"WINDISCHESCHENBACH","NEUHAUS",374168,4303,""]
[null,"WINDISCHESCHENBACH","WINDISCHESCHENBACH",374168,4304,""]
[null,"WINDISCHESCHENBACH","DIETERSDORF",374168,4305,""]
[null,"WINDORF","ALBERSDORF",275159,6256,""]
[null,"WINDORF","RATHSMANNSDORF",275159,6257,""]
[null,"WINDORF","OTTERSKIRCHEN",275159,6258,""]
[null,"WINDORF","WINDORF",275159,6259,""]
[null,"WINDSBACH","BERTHOLDSDORF",571226,3112,""]
[null,"WINDSBACH","BRUNN",571226,3121,""]
[null,"WINDSBACH","ELPERSDORF B.WINDSBACH",571226,3134,""]
[null,"WINDSBACH","HERGERSBACH",571226,3156,""]
[null,"WINDSBACH","ISMANNSDORF",571226,3166,""]
[null,"WINDSBACH","MOOSBACH",571226,3190,""]
[null,"WINDSBACH","RETZENDORF",571226,3210,""]
[null,"WINDSBACH","SAUERNHEIM",571226,3215,""]
[null,"WINDSBACH","SUDDERSDORF",571226,3224,""]
[null,"WINDSBACH","UNTERESCHENBACH",571226,3226,""]
[null,"WINDSBACH","VEITSAURACH",571226,3229,""]
[null,"WINDSBACH","WERNSBACH",571226,3240,""]
[null,"WINDSBACH","WINDSBACH",571226,3244,""]
[null,"WINDSBACH","WINKELHAID",571226,3245,{"$f":"+IF(A8514<>\"\",1,\"\")","v":""}]
[null,"WINHÖRING","EGGEN",171137,8907,""]
[null,"WINHÖRING","WINHÖRING",171137,8945,""]
[null,"WINKELHAID","WINKELHAID",574464,3477,""]
[null,"WINKELHAID (LKR. RH)","PENZENHOFEN",574164,3453,""]
[null,"WINKELHAID (LKR. RH)","WINKELHAID",574164,3477,""]
[null,"WINKELHOFER FORST","BUCH",471461,2123,""]
[null,"WINKLARN","SCHNEEBERG",376178,4829,""]
[null,"WINKLARN","PONDORF",376178,4830,""]
[null,"WINKLARN","NUNZENRIED",376178,4831,""]
[null,"WINKLARN","WINKLARN",376178,4832,""]
[null,"WINKLARN","MUSCHENRIED",376178,4833,""]
[null,"WINKLARN","HAAG",376178,4834,""]
[null,"WINTERBACH","WALDKIRCH",774196,7123,""]
[null,"WINTERBACH","WINTERBACH",774196,7124,""]
[null,"WINTERBACH","RECHBERGREUTHEN",774196,7125,""]
[null,"WINTERHAUSEN","WINTERHAUSEN",679206,727,""]
[null,"WINTERRIEDEN","WINTERRIEDEN",778217,7539,""]
[null,"WINTERSTEIG","JULBACH",277452,6519,""]
[null,"WINZER","SCHWANENKIRCHEN",271153,5947,""]
[null,"WINZER","WINZER",271153,5953,""]
[null,"WINZER","NEßLBACH",271153,5954,""]
[null,"WINZERWALD","MINDELZELL",774452,7732,""]
[null,"WIPFELD","WIPFELD",678196,1014,""]
[null,"WIRSBERG","NEUFANG",477163,1772,""]
[null,"WIRSBERG","WIRSBERG",477163,1773,""]
[null,"WITTELSHOFEN","DÜHREN",571227,3662,""]
[null,"WITTELSHOFEN","UNTERMICHELBACH",571227,3663,""]
[null,"WITTELSHOFEN","ILLENSCHWANG",571227,3664,""]
[null,"WITTELSHOFEN","OBERMICHELBACH",571227,3665,""]
[null,"WITTELSHOFEN","WITTELSHOFEN",571227,3666,""]
[null,"WITTIBREUT","WITTIBREUT",277152,6510,""]
[null,"WITTIBREUT","ULBERING",277152,6511,""]
[null,"WITTISLINGEN","WITTISLINGEN",773183,6846,""]
[null,"WITTISLINGEN","SCHABRINGEN",773183,6847,""]
[null,"WITZMANNSBERG","WITZMANNSBERG",275160,6303,""]
[null,"WOLFERLOHE","WOLFERLOHE",376455,4762,""]
[null,"WOLFERSDORF","DÜRNHAINDLFING",178156,8280,""]
[null,"WOLFERSDORF","WOLFERSDORF",178156,8281,""]
[null,"WOLFERSDORF","BERGHASELBACH",178156,8282,""]
[null,"WOLFERSTADT","ZWERCHSTRAß",779231,6901,""]
[null,"WOLFERSTADT","HAGAU",779231,6902,""]
[null,"WOLFERSTADT","WOLFERSTADT",779231,6903,""]
[null,"WOLFERTSCHWENDEN","DIETRATRIED",778218,7606,""]
[null,"WOLFERTSCHWENDEN","NIEDERDORF",778218,7607,""]
[null,"WOLFERTSCHWENDEN","WOLFERTSCHWENDEN",778218,7608,""]
[null,"WOLFRAMS-ESCHENBACH","BIEDERBACH",571229,3114,""]
[null,"WOLFRAMS-ESCHENBACH","GERBERSDORF",571229,3143,""]
[null,"WOLFRAMS-ESCHENBACH","REUTERN",571229,3211,""]
[null,"WOLFRAMS-ESCHENBACH","SELGENSTADT",571229,3219,""]
[null,"WOLFRAMS-ESCHENBACH","WOLFRAMS-ESCHENBACH",571229,3246,""]
[null,"WOLFRATSHAUSEN","WOLFRATSHAUSEN",173147,9321,""]
[null,"WOLFRATSHAUSEN","WEIDACH",173147,9322,""]
[null,"WOLFRATSHAUSER FORST","WOLFRATSHAUSER FORST",173452,9325,""]
[null,"WOLFSEGG","WOLFSEGG",375211,5354,""]
[null,"WOLLBACH","WOLLBACH",673183,63,""]
[null,"WOLNZACH","BURGSTALL",186162,8194,""]
[null,"WOLNZACH","NIEDERLAUTERBACH",186162,8219,""]
[null,"WOLNZACH","KÖNIGSFELD",186162,8220,""]
[null,"WOLNZACH","GOSSELTSHAUSEN",186162,8221,""]
[null,"WOLNZACH","ESCHELBACH A.D.ILM",186162,8222,""]
[null,"WOLNZACH","WOLNZACH",186162,8223,""]
[null,"WOLNZACH","HAUSHAUSEN",186162,8224,""]
[null,"WOLNZACH","OBERLAUTERBACH",186162,8225,""]
[null,"WOLNZACH","GEBRONTSHAUSEN",186162,8226,{"$f":"+IF(A8578<>\"\",1,\"\")","v":""}]
[null,"WOLNZACH","GEROLDSHAUSEN I.D.HALLERTAU",186162,8227,""]
[null,"WOLNZACH","LARSBACH",186162,8228,""]
[null,"WONFURT","WONFURT",674219,941,""]
[null,"WONFURT","DAMPFACH",674219,959,""]
[null,"WONFURT","STEINSFELD",674219,960,""]
[null,"WONFURT","REINHARDSWINDEN",674219,984,""]
[null,"WONNEBERG","WONNEBERG",189165,9841,""]
[null,"WONSEES","WONSEES",477164,1787,""]
[null,"WONSEES","SCHIRRADORF",477164,1788,""]
[null,"WONSEES","SANSPAREIL",477164,1789,""]
[null,"WORINGEN","WORINGEN",778219,7603,""]
[null,"WÖRNITZ","ERZBERG",571228,2943,""]
[null,"WÖRNITZ","WÖRNITZ",571228,3069,""]
[null,"WÖRTH","WÖRTH",177144,8390,""]
[null,"WÖRTH A.D.DONAU","BRENNBERG",375210,5212,""]
[null,"WÖRTH A.D.DONAU","HOFDORF",375210,5263,""]
[null,"WÖRTH A.D.DONAU","HUNGERSACKER",375210,5265,""]
[null,"WÖRTH A.D.DONAU","KIEFENHOLZ",375210,5270,""]
[null,"WÖRTH A.D.DONAU","OBERACHDORF",375210,5293,""]
[null,"WÖRTH A.D.DONAU","TIEFENTHAL",375210,5341,""]
[null,"WÖRTH A.D.DONAU","WEIHERN",375210,5347,""]
[null,"WÖRTH A.D.DONAU","WÖRTH A.D.DONAU",375210,5352,""]
[null,"WÖRTH A.D.DONAU","ZINZENDORF",375210,5360,""]
[null,"WÖRTH A.D.ISAR","POSTAU",274191,6596,""]
[null,"WÖRTH A.D.ISAR","WÖRTH A.D.ISAR",274191,6602,""]
[null,"WÖRTH A.MAIN","WÖRTH A.MAIN",676169,431,""]
[null,"WÖRTHSEE","ETTERSCHLAG",188145,9155,""]
[null,"WÖRTHSEE","STEINEBACH A.WÖRTHSEE",188145,9160,""]
[null,"WÜLFERSHAUSEN A.D.SA","WÜLFERSHAUSEN A.D.SAALE",673184,82,""]
[null,"WÜLFERSHAUSEN A.D.SA","EICHENHAUSEN",673184,94,""]
[null,"WUNSIEDEL","TRÖSTAUER FORST-OST",479169,2061,""]
[null,"WUNSIEDEL","HILDENBACH",479169,2067,""]
[null,"WUNSIEDEL","WUNSIEDEL",479169,2068,""]
[null,"WUNSIEDEL","BERNSTEIN",479169,2069,""]
[null,"WUNSIEDEL","HOLENBRUNN",479169,2070,""]
[null,"WUNSIEDEL","SCHÖNBRUNN",479169,2071,""]
[null,"WUNSIEDEL","WUNSIEDEL, BERGWERKE",479169,2097,""]
[null,"WURMANNSQUICK","HICKERSTALL",277153,6421,""]
[null,"WURMANNSQUICK","HIRSCHHORN",277153,6423,""]
[null,"WURMANNSQUICK","LANGENECK",277153,6430,""]
[null,"WURMANNSQUICK","LOHBRUCK",277153,6435,""]
[null,"WURMANNSQUICK","MARTINSKIRCHEN",277153,6439,""]
[null,"WURMANNSQUICK","ROGGLFING",277153,6457,""]
[null,"WURMANNSQUICK","WURMANNSQUICK",277153,6481,""]
[null,"WURMSHAM","RUPRECHTSBERG",274193,6673,""]
[null,"WURMSHAM","PAULUSZELL",274193,6677,""]
[null,"WURMSHAM","WURMSHAM",274193,6678,""]
[null,"WÜRZBURG","OBERDÜRRBACH",663000,686,""]
[null,"WÜRZBURG","VERSBACH",663000,687,""]
[null,"WÜRZBURG","UNTERDÜRRBACH",663000,696,""]
[null,"WÜRZBURG","WÜRZBURG",663000,697,""]
[null,"WÜRZBURG","LENGFELD",663000,698,""]
[null,"WÜRZBURG","HEIDINGSFELD",663000,707,""]
[null,"WÜRZBURG","ROTTENBAUER",663000,722,""]
[null,"WÜRZBURG","WÜRZBURG SEKTION 2",663000,782,""]
[null,"WÜRZBURG","WÜRZBURG SEKTION 3",663000,783,""]
[null,"WÜRZBURG","WÜRZBURG SEKTION 4",663000,784,""]
[null,"WUSTVIELER FORST","WUSTVIELER FORST",678457,1041,""]
[null,"ZACHENBERG","ZACHENBERG",276146,5739,""]
[null,"ZANDT","ZANDT",372177,5154,""]
[null,"ZANDT","HARRLING",372177,5155,""]
[null,"ZANDT","WOLFERSDORF",372177,5156,""]
[null,"ZANDT","GRUB",372177,5157,""]
[null,"ZANGBERG","ZANGBERG",183151,8817,{"$f":"+IF(A8642<>\"\",1,\"\")","v":""}]
[null,"ZANGBERG","WEILKIRCHEN",183151,8818,""]
[null,"ZAPFENDORF","KIRCHSCHLETTEN",471214,2202,""]
[null,"ZAPFENDORF","LAUF",471214,2209,""]
[null,"ZAPFENDORF","Oberleiterbach",471214,2245,""]
[null,"ZAPFENDORF","OBEROBERNDORF",471214,2249,""]
[null,"ZAPFENDORF","REUTHLOS",471214,2268,""]
[null,"ZAPFENDORF","SASSENDORF",471214,2277,""]
[null,"ZAPFENDORF","UNTERLEITERBACH",471214,2316,""]
[null,"ZAPFENDORF","ZAPFENDORF",471214,2343,""]
[null,"ZEIL A.MAIN","SECHSTHAL",674221,902,""]
[null,"ZEIL A.MAIN","KRUM",674221,919,""]
[null,"ZEIL A.MAIN","BISCHOFSHEIM",674221,920,""]
[null,"ZEIL A.MAIN","BISCHOFSHEIMER FORST-SÜDWEST",674221,921,""]
[null,"ZEIL A.MAIN","BISCHOFSHEIMER FORST-NORDOST",674221,922,""]
[null,"ZEIL A.MAIN","ZEIL A.MAIN",674221,943,""]
[null,"ZEIL A.MAIN","SCHMACHTENBERG",674221,944,""]
[null,"ZEIL A.MAIN","ZIEGELANGER",674221,964,""]
[null,"ZEILARN","OBERTÜRKEN",277154,6504,""]
[null,"ZEILARN","SCHILDTHURN",277154,6505,""]
[null,"ZEILARN","GUMPERSDORF",277154,6506,""]
[null,"ZEITLARN","REGENDORF",375213,5312,""]
[null,"ZEITLARN","ZEITLARN",375213,5358,""]
[null,"ZEITLOFS","ECKARTS-RUPBODEN",672166,181,""]
[null,"ZEITLOFS","ZEITLOFS",672166,194,""]
[null,"ZEITLOFS","RUPBODENER FORST",672166,195,""]
[null,"ZEITLOFS","FORST DETTER-NORD",672166,196,""]
[null,"ZEITLOFS","ROßBACH",672166,212,""]
[null,"ZEITLOFS","WEIßENBACH",672166,213,""]
[null,"ZEITLOFS","ROßBACHER FORST",672166,225,""]
[null,"ZEITLOFS","DETTER",672166,226,""]
[null,"ZEITLOFS","FORST DETTER-SÜD",672166,235,""]
[null,"ZELL (LKR. CHA)","BEUCHERLING",372167,5130,""]
[null,"ZELL (LKR. CHA)","ZELL",372167,5131,""]
[null,"ZELL (LKR. CHA)","UNTERZELL",372167,5132,""]
[null,"ZELL (LKR. CHA)","SCHILLERTSWIESEN",372167,5133,""]
[null,"ZELL (LKR. HO)","GROSSENAU",475189,1946,""]
[null,"ZELL (LKR. HO)","WALPENREUTH",475189,1947,""]
[null,"ZELL (LKR. HO)","ZELL",475189,1948,""]
[null,"ZELL (LKR. HO)","KLEINLOSNITZ",475189,1949,""]
[null,"ZELL (LKR. HO)","FRIEDMANNSDORF",475189,1950,""]
[null,"ZELL (LKR. HO)","SPARNECKER FORST",475189,1986,""]
[null,"ZELL A.MAIN","ZELL A.MAIN",679209,695,""]
[null,"ZELLER FORST-WEST","ZELL A.EBERSBERG",674457,990,""]
[null,"ZELLER FORST-WEST","ZELLER FORST-WEST",674457,991,""]
[null,"ZELLINGEN","DUTTENBRUNN",677203,651,""]
[null,"ZELLINGEN","ZELLINGEN",677203,653,""]
[null,"ZELLINGEN","MARKT RETZBACH",677203,654,""]
[null,"ZENTING","ZENTING",272152,5836,""]
[null,"ZENTING","RANFELS",272152,5853,""]
[null,"ZERZABELSHOFER FORST","ZERZABELSHOFER FORST",574465,3486,""]
[null,"ZIEMETSHAUSEN","ZIEMETSHAUSEN",774198,7734,""]
[null,"ZIEMETSHAUSEN","UTTENHOFEN",774198,7735,""]
[null,"ZIEMETSHAUSEN","SCHÖNEBACH",774198,7736,""]
[null,"ZIEMETSHAUSEN","SCHELLENBACH",774198,7737,""]
[null,"ZIEMETSHAUSEN","MUTTERSHOFEN",774198,7738,""]
[null,"ZIEMETSHAUSEN","HELLERSBERG",774198,7739,""]
[null,"ZIEMETSHAUSEN","LAUTERBACH",774198,7740,""]
[null,"ZIERTHEIM","REISTINGEN",773186,6841,""]
[null,"ZIERTHEIM","DATTENHAUSEN",773186,6842,""]
[null,"ZIERTHEIM","ZIERTHEIM",773186,6843,""]
[null,"ZIRNDORF","ZIRNDORF",573134,3349,""]
[null,"ZIRNDORF","BRONNAMBERG",573134,3350,""]
[null,"ZIRNDORF","WEINZIERLEIN",573134,3351,""]
[null,"ZIRNDORF","LEICHENDORF",573134,3352,{"$f":"+IF(A8706<>\"\",1,\"\")","v":""}]
[null,"ZOLLING","WIMPASING",178157,8286,""]
[null,"ZOLLING","PALZING",178157,8287,""]
[null,"ZOLLING","ZOLLING",178157,8288,""]
[null,"ZOLLING","ANGLBERG",178157,8289,""]
[null,"ZOLLING","APPERSDORF",178157,8290,""]
[null,"ZOLLING","ITZLING",178157,8316,""]
[null,"ZOLLING","TÜNTENHAUSEN",178157,8317,""]
[null,"ZORNEDING","PÖRING",175139,8775,""]
[null,"ZORNEDING","ZORNEDING",175139,8780,""]
[null,"ZÖSCHINGEN","ZÖSCHINGEN",773187,6834,""]
[null,"ZÜCKSHUTER FORST","ZÜCKSHUTER FORST",471462,2350,""]
[null,"ZUSAMALTHEIM","ZUSAMALTHEIM",773188,6887,""]
[null,"ZUSAMALTHEIM","SONTHEIM",773188,6888,""]
[null,"ZUSMARSHAUSEN","ZUSMARSHAUSEN",772223,7238,""]
[null,"ZUSMARSHAUSEN","WÖRLESCHWANG",772223,7239,""]
[null,"ZUSMARSHAUSEN","WOLLBACH",772223,7240,""]
[null,"ZUSMARSHAUSEN","VALLRIED",772223,7241,""]
[null,"ZUSMARSHAUSEN","GABELBACHERGREUT",772223,7242,""]
[null,"ZUSMARSHAUSEN","GABELBACH",772223,7243,""]
[null,"ZUSMARSHAUSEN","STEINEKIRCH",772223,7244,""]
[null,"ZUSMARSHAUSEN","STREITHEIM",772223,7245,""]
[null,"ZWIESEL","RABENSTEIN",276148,5713,""]
[null,"ZWIESEL","KLAUTZENBACH",276148,5731,""]
[null,"ZWIESEL","ZWIESEL",276148,5732,""]
[null,"ZWIESEL","BÄRNZELL",276148,5745,""]